Peptide,PTM,ModifiedAA,ModifiedPosition,PeptideUniqueToGene,ExperimentDesc,ExpID,PubmedID,ScoreType,IdentScore,LocProb,Log2FChange,PQ-val,QuantSig,PEP,MassErrorPPM
AASVMLSSVTLKPAGFTVE,nt,A,2,true,"N-terminal ChaFRADIC",92,26010716,"MASCOT Score",21.7400000,,,,,0.019579999148846,
AASVMLSSVTLKPAGFTVEKTAAR,nta,A,2,true,"HUNTER N-terminome: legumain, GluC and trypsin",119,31951383,"MaxQuant score",60.7650000,,,,,,
AASVMLSSVTLKPAGFTVE,nta,A,2,true,"N-terminal ChaFRADIC",92,26010716,"MASCOT Score",21.7400000,,,,,0.019579999148846,
MAASVMLSSVTLK,ph,S,4,true,"BSK8 and BSL2 regulating sucrose-ph synthase",66,24924143,"MaxQuant Score",83.0870000,,,,,,-0.6559800
AASVMLSSVTLK,ph,S,8,true,"BSK8 and BSL2 regulating sucrose-ph synthase",66,24924143,"MaxQuant Score",70.2600000,,,,,,0.2143900
AASVMLSSVTLK,ph,T,11,true,"BSK8 and BSL2 regulating sucrose-ph synthase",66,24924143,"MaxQuant Score",70.2600000,,,,,,0.2143900
IKTDKPFGINGSMDLR,ac,K,48,true,"Quantitative Acetylproteomics",101,29440448,,,,,,,,
IKTDKPFGINGSMDLR,ph,T,49,true,"atm and atr DNA damage response",88,25561503,"MASCOT Score",27.0000000,1.0000000,,,,,-0.8400000
IKTDKPFGINGSMDLR,ph,T,49,true,"Tissue atlas Arabidopsis - ProteomicsDB",114,32188942,"MaxQuant score",70.0720000,0.9999970,,,,0.00039902099524625,
TDKPFGINGSMDLR,ac,K,51,true,"Histone deacetylases- hda14 vs WT (low light)",98c,29061669,"MaxQuant Score",95.7500000,1.0000000,0.5150000,0.9885531,NO,0.0020000000949949,
TDKPFGINGSMDLR,ac,K,51,true,"Histone deacetylases - hda14 vs WT (thylakoids)",98d,29061669,"MaxQuant Score",68.0000000,1.0000000,1.4670000,0.8375293,NO,0.00012500000593718,
TDKPFGINGSMDLR,ng,N,56,true,"Conserved N-glycosylation",74,22633491,"MaxQuant Score",99.3200000,1.0000000,,,,2.4900000425987E-5,0.0830000
TDKPFGINGSMDLRDGVDASGR,ph,S,58,true,"STN8 phosphoproteome",38,21768351,"MASCOT Score",53.1700000,,,,,,
TDKPFGINGSMDLRDGVDASGR,ph,S,58,true,"Chloroplast kinase substrates",60,19376835,"MASCOT Score",49.7700000,,,,,,-0.5095080
IKTDKPFGINGSMDLR,ph,S,58,true,"STN8 phosphoproteome",38,21768351,"MASCOT Score",58.0300000,,,,,,
IKTDKPFGINGSMDLR,ph,S,58,true,"Phosphoproteome ethylene-regulated time response",46,24043427,"MASCOT Score",47.3700000,,,,,,-8.5846000
IKTDKPFGINGSMDLR,ph,S,58,true,"Chloroplast kinase substrates",60,19376835,"MASCOT Score",49.2900000,,,,,,-0.3333020
TDKPFGINGSMDLR,ph,S,58,true,"STN8 phosphoproteome",38,21768351,"MASCOT Score",62.7800000,,,,,,
TDKPFGINGSMDLR,ph,S,58,true,"Tyrosine phosphorylation in Arabidopsis",59,18463617,"MASCOT Score",31.0000000,,,,,,-0.9204031
TDKPFGINGSMDLR,ph,S,58,true,"Chloroplast kinase substrates",60,19376835,"MASCOT Score",57.2500000,,,,,,-0.5118450
TDKPFGINGSMDLR,ph,S,58,true,"Conserved plant phosphoproteome - Arabidopsis",61a,20466843,"MASCOT Score",42.0000000,1.0000000,,,,,
TDKPFGINGSMDLR,ph,S,58,true,"atm and atr DNA damage response",88,25561503,"MASCOT Score",45.0000000,1.0000000,,,,,-0.1200000
TDKPFGINGSMDLR,ph,S,58,true,"TOR Kinase and ABA Receptor",100,29290610,XCorr,3.8734012,1.0000000,,,,0.00011890000314452,
TDKPFGINGSMDLR,ph,S,58,true,"Phospho cell culture sucrose/TOR",109,30833711,,,0.9999990,,,,,
TDKPFGINGSMDLR,ph,S,58,true,"Tissue atlas Arabidopsis - ProteomicsDB",114,32188942,"MaxQuant score",213.9100000,1.0000000,,,,0,
TDKPFGINGSMDLR,ph,S,58,true,"Touch-induced phosphorylation: 40s touch vs untouc",136,30291188,"MASCOT score",86.6100000,,0.1246051,0.9366935,NO,,0.0786764
DGVDASGRK,ph,S,68,true,"atm and atr DNA damage response",88,25561503,"MASCOT Score",22.0000000,1.0000000,,,,,-0.0800000
KGKGYGVYK,ac,K,73,true,"Quantitative Acetylproteomics",101,29440448,,,,,,,,
GKGYGVYK,ac,K,73,true,"Histone deacetylases - apicidin vs control",98a,29061669,"MaxQuant Score",112.0000000,1.0000000,0.1000000,0.7112135,NO,0.0040000001899898,
GKGYGVYK,ac,K,73,true,"Quantitative Acetylproteomics",101,29440448,,,,,,,,
GYGVYKYVDK,ac,K,79,true,"Histone deacetylases - apicidin vs control",98a,29061669,"MaxQuant Score",129.9000000,1.0000000,0.2430000,0.3689776,NO,3.5000000675467E-9,
GYGVYKYVDK,ac,K,79,true,"Histone deacetylases substrates - TSA vs control",98b,29061669,"MaxQuant Score",129.9000000,1.0000000,0.1790000,0.9977001,NO,3.5000000675467E-9,
GYGVYKYVDK,ac,K,79,true,"Histone deacetylases- hda14 vs WT (low light)",98c,29061669,"MaxQuant Score",125.7200000,1.0000000,2.3310000,0.2792544,NO,0.0020000000949949,
GYGVYKYVDK,ac,K,79,true,"Histone deacetylases - hda14 vs WT (thylakoids)",98d,29061669,"MaxQuant Score",139.9000000,1.0000000,1.1690000,0.4864072,NO,4.2700001756657E-8,
GYGVYKYVDK,ac,K,79,true,"Histone deacetylases substrates - hda14 vs WT",98e,29061669,"MaxQuant Score",137.9000000,1.0000000,0.4070000,0.9078205,NO,4.3000001453001E-17,
GYGVYKYVDK,ac,K,79,true,"Quantitative Acetylproteomics",101,29440448,,,,,,,,
GYGVYKYVDK,hib,K,79,true,"Open search Plant PTM Viewer 2.0 - hib",164e,TBA,,,,,,,,
YVDKYGANVDGYSPIYNENEWSASGDVYK,ac,K,83,true,"Histone deacetylases - hda14 vs WT (thylakoids)",98d,29061669,"MaxQuant Score",104.1000000,1.0000000,0.3970000,0.6426877,NO,4.8799999101506E-31,
YVDKYGANVDGYSPIYNENEWSASGDVYK,ac,K,83,true,"Histone deacetylases substrates - hda14 vs WT",98e,29061669,"MaxQuant Score",54.5000000,1.0000000,0.2200000,0.9204496,NO,2.2000000171829E-5,
SPIYNEN,nt,S,92,true,"N-terminal ChaFRADIC",92,26010716,"MASCOT Score",28.8200000,,,,,0.033390000462532,
