Peptide,PTM,ModifiedAA,ModifiedPosition,PeptideUniqueToGene,ExperimentDesc,ExpID,PubmedID,ScoreType,IdentScore,LocProb,Log2FChange,PQ-val,QuantSig,PEP,MassErrorPPM
PAFYGGKLTTFEDDEKESEYGYVR,nt,P,2,true,"Arabidopsis translation initiation landscape - NT",167b,35069635,,,,,,,,
PAFYGGKLTTFEDDEKESEYGYVR,nta,P,2,true,"Arg/N-end rule pathway Roots",80,25728785,"MASCOT Score",45.1500000,,,,,3.3539998867127E-7,
AFYGGKLTTFE,nt,A,3,true,"N-terminal ChaFRADIC",92,26010716,"MASCOT Score",20.4000000,,,,,0.045049998909235,
AFYGGKLTTFE,nt,A,3,true,"Arg/N-end rule seed, prt6 vs. Wt",99,29168982,"MASCOT Score",29.7400000,,,,,6.8300003476907E-5,0.3666951
AFYGGKLTTFEDDEKESEYGYVR,nta,A,3,true,"Arabidopsis translation initiation landscape - NTA",167a,35069635,,,,,,,,
AFYGGKLTTFE,nta,A,3,true,"N-terminal ChaFRADIC",92,26010716,"MASCOT Score",20.4000000,,,,,0.045049998909235,
AFYGGKLTTFE,nta,A,3,true,"Arg/N-end rule seed, prt6 vs. Wt",99,29168982,"MASCOT Score",29.7400000,,-0.4399676,0.1408968,NO,6.8300003476907E-5,0.3666951
MPAFYGGKLTTFEDDEK,ph,Y,5,true,"Phosphorylation in N starvation",63,22060019,"MASCOT Score",21.0000000,,,,,,-1.2260500
GKLTTFEDDEKESE,nt,G,7,true,"HUNTER N-terminome: legumain, GluC and trypsin",119,31951383,"MaxQuant score",104.1700000,,,,,,
PAFYGGKLTTFEDDEKESEYGYVR,ub,K,8,true,"upl3 mutant / wildtype",168,35926874,"MaxQuant score",162.8100000,1.0000000,0.2078929,0.7800400,NO,2.8883800710052E-36,0.8564700
MPAFYGGKLTTFEDDEK,ph,T,10,true,"Phosphorylation in N starvation",63,22060019,"MASCOT Score",21.0000000,,,,,,-1.2260500
LTTFEDDEK,ph,T,11,true,"Tissue atlas Arabidopsis - ProteomicsDB",114,32188942,"MaxQuant score",88.0560000,0.9994050,,,,0.0073822401463985,
LTTFEDDEKESEYGYVR,ub,K,17,true,"upl3 mutant / wildtype",168,35926874,"MaxQuant score",237.5900000,1.0000000,0.2845141,0.5144400,NO,2.8025969286496E-45,-0.3365900
KVSGPVVVADGMAGAAMYELVR,ub,K,26,true,"Ubiquitination Membrane Proteins",120,33585938,,,,,,,,
KVSGPVVVADGMAGAAMYELVR,ub,K,26,true,"upl3 mutant / wildtype",168,35926874,"MaxQuant score",99.9570000,1.0000000,0.8221183,,,1.979119979012E-9,0.4933800
VYEETAGLTVNDPVLR,nt,V,69,true,"Tic56 chloroplast import - tic56-1",89c,25588737,XCorr,3.1544721,,,,,,
SVELGPGIL,nt,S,90,true,"N-terminal ChaFRADIC",92,26010716,"MASCOT Score",54.3100000,,,,,1.304000033997E-5,
ISGDVYIPR,ph,S,116,true,"Tissue atlas Arabidopsis - ProteomicsDB",114,32188942,"MaxQuant score",75.2290000,0.9999910,,,,0.0064320201054215,
ISGDVYIPR,ph,Y,120,true,"MAPK Arabidopsis substrates",45,23172892,"MaxQuant Score",53.7750000,,,,,,
GVSVPALDKDCLWEFQPNK,ph,S,126,true,"Phosphorylation in N starvation",63,22060019,"MASCOT Score",99.0000000,,,,,,0.3047180
GVSVPALDK,ph,S,126,true,"atm and atr DNA damage response",88,25561503,"MASCOT Score",31.0000000,1.0000000,,,,,-0.0300000
GVSVPALDK,ph,S,126,true,"TOR Kinase and ABA Receptor",100,29290610,XCorr,2.6854753,1.0000000,,,,0.0013810000382364,
GVSVPALDK,ph,S,126,true,"Tissue atlas Arabidopsis - ProteomicsDB",114,32188942,"MaxQuant score",85.9630000,1.0000000,,,,0.0015118699520826,
GVSVPALDKDCLWEFQPNK,ox,C,134,true,"SPEAR - 50 mM H2O2 / mock",138b,34619326,,,,5.1276598,0.0018711,YES,,
GVSVPALDKDCLWEFQPNK,so,C,134,true,"S-sulfenylation site detection using YAP1C",110,32714340,,,,,,,,
SYTMLQSWPVRTPRPVASK,ph,T,215,true,"Tissue atlas Arabidopsis - ProteomicsDB",114,32188942,"MaxQuant score",119.2800000,0.9908720,,,,2.745419959893E-14,
TPRPVASKLAADTPLLTGQR,ub,K,222,true,"upl3 mutant / wildtype",168,35926874,"MaxQuant score",64.5220000,1.0000000,-0.6506347,,,9.6365598437842E-5,-0.7076600
VLDALFPSVLGGTCAIPGAFGCGK,so,C,248,true,"S-sulfenylation site detection using YAP1C",110,32714340,,,,,,,,
YSNSDAVVYVGCGER,acy,C,279,true,"Arabidopsis S-acylation atlas - Meristem",163a,35681017,,,,,,,,
YSNSDAVVYVGCGER,so,C,279,true,"S-sulfenylation site detection using YAP1C",110,32714340,,,,,,,,
EESVMKR,ac,K,310,true,"Quantitative Acetylproteomics",101,29440448,,,,,,,,
LAEMPADSGYPAYLAAR,ph,Y,380,true,"SIRK1 phosphorylation",86a,23820729,"MaxQuant Score",69.1070000,0.9970000,,,,1.164999961853,10.2290000
LASFYER,ph,S,387,true,"STN8 phosphoproteome",38,21768351,"MASCOT Score",58.5000000,,,,,,0.3565920
LASFYER,ph,S,387,true,"Phospho cell culture sucrose/TOR",109,30833711,,,0.9998150,,,,,
CLGGPER,sno,C,397,true,"hot5-4 / wildtype, FAT-switch S-nitrosoproteome",169,37277371,,,,,,,,
CLGGPER,so,C,397,true,"S-sulfenylation site detection using YAP1C",110,32714340,,,,,,,,
DALAEGDKITLETAKLLR,cr,K,516,true,"Open search Plant PTM Viewer 2.0 - Crotonylation",164c,TBA,,,,,,,,
FCPFYK,so,C,535,true,"S-sulfenylation site detection using YAP1C",110,32714340,,,,,,,,
FYNLANQAVE,nt,F,550,true,"Arg/N-end rule seed, prt6 vs. Wt",99,29168982,"MASCOT Score",50.0900000,,-1.1193686,0.1213943,NO,0.00035439999192022,-0.9888825
NLANQAVE,nt,N,552,true,"Arg/N-end rule seed, prt6 vs. Wt",99,29168982,"MASCOT Score",64.0000000,,-0.7997805,0.0075242,NO,0.0063570002093911,-0.2366875
ITYTLIKHR,ac,K,575,true,"Histone deacetylases - apicidin vs control",98a,29061669,"MaxQuant Score",82.3000000,1.0000000,-0.1120000,0.6501297,NO,0.00062000000616536,
ITYTLIKHR,ac,K,575,true,"Histone deacetylases substrates - TSA vs control",98b,29061669,"MaxQuant Score",82.3000000,1.0000000,-0.7280000,0.7413102,NO,0.00062000000616536,
ITYTLIKHR,ac,K,575,true,"Quantitative Acetylproteomics",101,29440448,,,,,,,,
LVSQKFEDPAEGEDTLVEK,ac,K,589,true,"Histone deacetylases - apicidin vs control",98a,29061669,"MaxQuant Score",59.3000000,1.0000000,-0.2440000,0.1896706,NO,1.4999999464749E-8,
LVSQKFEDPAEGEDTLVEK,ac,K,589,true,"Histone deacetylases substrates - hda14 vs WT",98e,29061669,"MaxQuant Score",53.6000000,1.0000000,0.1140000,0.9120108,NO,0.00018000000272878,
LVSQKFEDPAEGEDTLVEK,ac,K,589,true,"Quantitative Acetylproteomics",101,29440448,,,,,,,,
