Peptide,PTM,ModifiedAA,ModifiedPosition,PeptideUniqueToGene,ExperimentDesc,ExpID,PubmedID,ScoreType,IdentScore,LocProb,Log2FChange,PQ-val,QuantSig,PEP,MassErrorPPM
ATILLPSQTGFDISR,nt,A,25,true,"N-terminal ChaFRADIC",92,26010716,"MASCOT Score",72.2400000,,,,,4.9979997918115E-9,
ATILLPSQTGFDISR,nt,A,25,true,"Arg/N-end rule seed, prt6 vs. Wt",99,29168982,"MASCOT Score",30.0000000,,-0.3395351,0.4421899,NO,0.19709999859333,-2.0268036
ATILLPSQTGFDISR,nt,A,25,true,"HUNTER N-terminome: legumain, GluC and trypsin",119,31951383,"MaxQuant score",47.7120000,,,,,,
ATILLPSQTGFDISR,nt,A,25,true,"Arabidopsis translation initiation landscape - NT",167b,35069635,,,,,,,,
RSPVCSAPDPNLNYRPVIGILSHPGDGASGR,nt,R,39,true,"HUNTER N-terminome: legumain, GluC and trypsin",119,31951383,"MaxQuant score",68.4340000,,,,,,
SPVCSAPDPNLNYRPVIGILSHPGDGASGR,nt,S,40,true,"HUNTER N-terminome: legumain, GluC and trypsin",119,31951383,"MaxQuant score",49.9680000,,,,,,
SPVCSAPDPNLNYRPVIGIL,nt,S,40,true,"N-terminal ChaFRADIC",92,26010716,"MASCOT Score",29.1800000,,,,,2.9980000704199E-9,
SPVCSAPDPNLNYR,nt,S,40,true,"Stromal N-terminome",96,26371235,"MASCOT Score",52.0100000,,,,,,
SPVCSAPDPNLNYR,nt,S,40,true,"Arg/N-end rule seed, prt6 vs. Wt",99,29168982,"MASCOT Score",56.8500000,,0.3054648,0.7406976,NO,0.0011990000493824,-1.1009641
SPVCSAPDPNLNYR,nt,S,40,true,"HUNTER N-terminome: legumain, GluC and trypsin",119,31951383,"MaxQuant score",105.0300000,,,,,,
SPVCSAPDPNLN,nt,S,40,true,"N-terminal ChaFRADIC",92,26010716,"MASCOT Score",33.4400000,,,,,0.041450001299381,
LSNATDASSIAASYVK,ng,N,72,true,"Conserved N-glycosylation",74,22633491,"MaxQuant Score",172.7000000,1.0000000,,,,0,-0.1730000
LSNATDASSIAASYVK,ng,N,72,true,"N-glycan occupancy Arabidopsis glycoproteins",87,23994444,"Ladder score",82.8000000,,,,,,
LSNATDASSIAASYVK,ng,N,72,true,"N-Glycopeptide Profiling in Arabidopsis Infloresce",132,27067053,"MOWSE score",56.6000000,,,,,4.1999999211839E-7,
LSNATDASSIAASYVK,ng,N,72,true,"ER-associatied N-glycan degradation chilling stres",133,27558752,,,,,,,,
LSNATDASSIAASYVK,ng,N,72,true,"N-linked Glycan Micro-heterogeneity Arabidopsis",134,29237727,,,,,,,,
LSNATDASSIAASYVK,ng,N,72,true,"UDP-GlcNAc transporter glycopeptide analysis",135,30224661,,,,,,,5.2851940097009E-19,-0.1000000
LGTDCLVMQNHR,acy,C,212,true,"Arabidopsis S-acylation atlas - Meristem",163a,35681017,,,,,,,,
LGTDCLVMQNHR,acy,C,212,true,"Arabidopsis S-acylation atlas - Hypocotyl",163b,35681017,,,,,,,,
LGTDCLVMQNHR,ox,C,212,true,"OxiTRAQ Arabidopsis - 5 mM H2O2 versus control",47,24376095,,,,-0.2566347,0.2624937,NO,,
LGTDCLVMQNHR,sno,C,212,true,"hot5-4 / wildtype, FAT-switch S-nitrosoproteome",169,37277371,,,,,,,,
IVTTCVDDNGK,ox,C,243,true,"SPEAR - 50 mM H2O2 / mock",138b,34619326,,,,2.4772312,0.0206044,YES,,
