Peptide,PTM,ModifiedAA,ModifiedPosition,PeptideUniqueToGene,ExperimentDesc,ExpID,PubmedID,ScoreType,IdentScore,LocProb,Log2FChange,PQ-val,QuantSig,PEP,MassErrorPPM
EAEPTTTTSLVPANQRWMFDEEE,nt,E,58,true,"HUNTER N-terminome: legumain, GluC and trypsin",119,31951383,"MaxQuant score",111.3800000,,,,,,
EAEPTTTTSLVPANQRWMFDEE,nt,E,58,true,"HUNTER N-terminome: legumain, GluC and trypsin",119,31951383,"MaxQuant score",78.4130000,,,,,,
EAEPTTTTSLVPANQR,nt,E,58,true,"Tic56 chloroplast import - wild-type",89a,25588737,XCorr,3.4788427,,,,,,
EAEPTTTTSLVPANQR,nt,E,58,true,"Tic56 chloroplast import - tic56-1",89c,25588737,XCorr,4.0926046,,,,,,
EAEPTTTTSLVPANQR,nt,E,58,true,"N-terminal ChaFRADIC",92,26010716,"MASCOT Score",81.6300000,,,,,7.6890000855201E-7,
EAEPTTTTSLVPANQR,nt,E,58,true,"Stromal N-terminome",96,26371235,"MASCOT Score",135.8200000,,,,,,
EAEPTTTTSLVPANQR,nt,E,58,true,"Arg/N-end rule seed, prt6 vs. Wt",99,29168982,"MASCOT Score",78.3000000,,0.0219013,0.8390666,NO,0.00025139999343082,-1.1454827
EAEPTTTTSLVPANQR,nt,E,58,true,"HUNTER N-terminome: legumain, GluC and trypsin",119,31951383,"MaxQuant score",315.1300000,,,,,,
EAEPTTTTSLVPANQR,nta,E,58,true,"N-terminal ChaFRADIC",92,26010716,"MASCOT Score",81.6300000,,,,,7.6890000855201E-7,
EAEPTTTTSLVPANQR,nta,E,58,true,"FtsH12 N-terminome: WT / FtsH12 knockdown miRNA",118,33216923,"MaxQuant score",88.1870000,,,,,0.0054572001099586,
AEPTTTTSLVPANQR,nt,A,59,true,"Tic56 chloroplast import - tic56-1",89c,25588737,XCorr,3.7754736,,,,,,
AEPTTTTSLVPANQR,nt,A,59,true,"N-terminal ChaFRADIC",92,26010716,"MASCOT Score",47.2300000,,,,,3.1869999694845E-11,
AEPTTTTSLVPANQR,nt,A,59,true,"Arg/N-end rule seed, prt6 vs. Wt",99,29168982,"MASCOT Score",49.5800000,,0.5935856,0.2350163,NO,0.00546699995175,-1.2619526
AEPTTTTSLVPANQR,nt,A,59,true,"HUNTER N-terminome: legumain, GluC and trypsin",119,31951383,"MaxQuant score",113.2200000,,,,,,
AEPTTTTSLVPANQR,nta,A,59,true,"FtsH12 N-terminome: WT / FtsH12 knockdown miRNA",118,33216923,"MaxQuant score",132.5000000,,,,,5.6899724143909E-41,
QRWMFDEEEAN,nt,Q,72,true,"HUNTER N-terminome: legumain, GluC and trypsin",119,31951383,"MaxQuant score",95.7750000,,,,,,
TFDQLQQRIPE,nt,T,178,true,"N-terminal ChaFRADIC",92,26010716,"MASCOT Score",24.4700000,,,,,2.2039999748813E-5,
GMLPKGR,ac,K,201,true,"Quantitative Acetylproteomics",101,29440448,,,,,,,,
