Peptide,PTM,ModifiedAA,ModifiedPosition,PeptideUniqueToGene,ExperimentDesc,ExpID,PubmedID,ScoreType,IdentScore,LocProb,Log2FChange,PQ-val,QuantSig,PEP,MassErrorPPM
AVDAADR,nt,A,2,true,"Arg/N-end rule seed, prt6 vs. Wt",99,29168982,"MASCOT Score",39.8200000,,-0.3434258,0.2407747,NO,0.16789999604225,-0.5399310
DGSYDFWTDGEGNLNK,ph,S,38,true,"Plasmamembrane phosphorylation",20,15308754,,,,,,,,
DGSYDFWTDGEGNLNK,ph,S,38,true,"Plasmembrane Ph Immune Responses",25,17651370,,,,,,,,
DGSYDFWTDGEGNLNK,ph,S,38,true,"Phytohormone-responsive phosphoproteins",34,20374526,"MASCOT Score",61.0000000,,,,,,-2.6809300
DGSYDFWTDGEGNLNK,ph,S,38,true,"srk2dei ABA signaling phopshoproteomics",83,23572148,"MASCOT Score",37.0000000,,,,,,0.0016000
DGSYDFWTDGEGNLNK,ph,S,38,true,"Phospho cell culture sucrose/TOR",109,30833711,,,0.9999990,,,,,
DGSYDFWTDGEGNLNK,ph,S,38,true,"Tissue atlas Arabidopsis - ProteomicsDB",114,32188942,"MaxQuant score",309.2900000,1.0000000,,,,0,
DGSYDFWTDGEGNLNK,ph,Y,39,true,"SnRK2 protein kinase substrates",85,23776212,XCorr,2.3591504,0.9670000,,,,0.032867800444365,
SAATTGEQQKDEGFEFR,ub,K,72,true,"Arabidopsis ubiquitination COFRADIC",40,26744219,"MaxQuant Score",70.7830000,1.0000000,,,,3.3889999140335E-10,-1.8960000
GLTPVSESPRVSTK,ph,T,119,true,"atm and atr DNA damage response",88,25561503,"MASCOT Score",28.0000000,1.0000000,,,,,1.7800000
GLTPVSESPR,ph,T,119,true,"atm and atr DNA damage response",88,25561503,"MASCOT Score",42.0000000,1.0000000,,,,,0.4000000
GLTPVSESPR,ph,T,119,true,"Tissue atlas Arabidopsis - ProteomicsDB",114,32188942,"MaxQuant score",157.9100000,1.0000000,,,,2.1708899122785E-9,
GLTPVSESPR,ph,S,122,true,"Tissue atlas Arabidopsis - ProteomicsDB",114,32188942,"MaxQuant score",105.4600000,0.9122320,,,,0.00022331500076689,
GLTPVSESPRVSTK,ph,S,124,true,"atm and atr DNA damage response",88,25561503,"MASCOT Score",29.0000000,1.0000000,,,,,-0.6600000
GLTPVSESPRVSTK,ph,S,124,true,"TOR Kinase and ABA Receptor",100,29290610,XCorr,4.5091085,0.9150000,,,,8.2440001278883E-6,
GLTPVSESPRVSTK,ph,S,124,true,"Tissue atlas Arabidopsis - ProteomicsDB",114,32188942,"MaxQuant score",232.6800000,0.9999290,,,,0,
GLTPVSESPR,ph,S,124,true,"atm and atr DNA damage response",88,25561503,"MASCOT Score",45.0000000,1.0000000,,,,,1.0200000
GLTPVSESPR,ph,S,124,true,"TOR Kinase and ABA Receptor",100,29290610,XCorr,2.1066976,0.9507000,,,,0.0063550001941621,
GLTPVSESPR,ph,S,124,true,"Col-0 callus - FC Col-0 vs. Col-0 Xray",111a,31410901,,36.3800000,,0.2089886,0.0000000,NO,,0.0230299
GLTPVSESPR,ph,S,124,true,"Col-0 X-ray callus - FC Col-0 vs. Col-0 Xray",111b,31410901,,36.3800000,,0.2089886,0.0000000,NO,,0.0230299
GLTPVSESPR,ph,S,124,true,"atm callus - FC atm vs. atm Xray",111c,31410901,,36.3800000,,-0.5093223,0.0000000,NO,,0.0230299
GLTPVSESPR,ph,S,124,true,"atm-3 X-ray callus - FC atm vs. atm Xray",111d,31410901,,36.3800000,,-0.5093223,0.0000000,NO,,0.0230299
GLTPVSESPRVSTK,ph,S,128,true,"Plasmamembrane phosphorylation",20,15308754,,,,,,,,
GLTPVSESPRVSTK,ph,S,128,true,"atm and atr DNA damage response",88,25561503,"MASCOT Score",29.0000000,0.9930000,,,,,-0.6600000
GLTPVSESPRVSTK,ph,S,128,true,"TOR Kinase and ABA Receptor",100,29290610,XCorr,4.5091085,0.9149000,,,,8.2440001278883E-6,
GLTPVSESPRVSTK,ph,S,128,true,"Tissue atlas Arabidopsis - ProteomicsDB",114,32188942,"MaxQuant score",232.6800000,0.9765940,,,,0,
RDSRSNTNNNDDGEVVK,ph,S,139,true,"TOR Kinase and ABA Receptor",100,29290610,XCorr,3.5905278,0.9183000,,,,4.4870001147501E-5,
SSSTLLK,ph,S,166,true,"Plasmembrane Ph Immune Responses",25,17651370,,,,,,,,
LSDPPTPQLPPQTADMKSGR,ph,T,189,true,"Tissue atlas Arabidopsis - ProteomicsDB",114,32188942,"MaxQuant score",47.5070000,0.8105490,,,,0.0015705700498074,
SGFFGKSPK,ph,S,211,true,"Tissue atlas Arabidopsis - ProteomicsDB",114,32188942,"MaxQuant score",136.9300000,1.0000000,,,,0.00042000599205494,
FQNPGGVEIQSGAQKSPMK,ph,S,442,true,"Tissue atlas Arabidopsis - ProteomicsDB",114,32188942,"MaxQuant score",102.2100000,0.8661540,,,,9.7625001416191E-9,
FQNPGGVEIQSGAQK,ph,S,442,true,"Phosphorylation Early Elicitor Signaling",23,17317660,,,,,,,,
KFQNPGGVEIQSGAQKSPMK,ph,S,447,true,"Phosphorylation Early Elicitor Signaling",23,17317660,,,,,,,,
KFQNPGGVEIQSGAQKSPMK,ph,S,447,true,"Tissue atlas Arabidopsis - ProteomicsDB",114,32188942,"MaxQuant score",207.7600000,0.9999960,,,,0,
SPFLSHVLSNGGGGGGENK,ph,S,462,true,"atm and atr DNA damage response",88,25561503,"MASCOT Score",76.0000000,1.0000000,,,,,-0.9700000
SPFLSHVLSNGGGGGGENK,ph,S,462,true,"TOR Kinase and ABA Receptor",100,29290610,XCorr,4.2395296,0.9975000,,,,1.7860000298242E-5,
SPFLSHVLSNGGGGGGENK,ph,S,462,true,"Tissue atlas Arabidopsis - ProteomicsDB",114,32188942,"MaxQuant score",320.1300000,1.0000000,,,,0,
GITIDSLHK,ph,S,478,true,"Tissue atlas Arabidopsis - ProteomicsDB",114,32188942,"MaxQuant score",127.5100000,0.9999990,,,,0.00016748999769334,
LNPKNVSAWK,ph,S,488,true,"Tissue atlas Arabidopsis - ProteomicsDB",114,32188942,"MaxQuant score",73.2600000,1.0000000,,,,0.0084806904196739,
