Peptide,PTM,ModifiedAA,ModifiedPosition,PeptideUniqueToGene,ExperimentDesc,ExpID,PubmedID,ScoreType,IdentScore,LocProb,Log2FChange,PQ-val,QuantSig,PEP,MassErrorPPM
VSDSSDDLRDSQMK,ph,S,15,true,"Conserved plant phosphoproteome - Arabidopsis",61a,20466843,"MASCOT Score",46.0000000,1.0000000,,,,,
VSDSSDDLR,ph,S,15,true,"Tissue atlas Arabidopsis - ProteomicsDB",114,32188942,"MaxQuant score",58.1320000,0.9825320,,,,0.016122600063682,
VSDSSDDLRDSQMK,ph,S,17,true,"Tyrosine phosphorylation in Arabidopsis",59,18463617,"MASCOT Score",46.0000000,,,,,,-0.7823506
VSDSSDDLRDSQMK,ph,S,17,true,"atm and atr DNA damage response",88,25561503,"MASCOT Score",20.0000000,0.9900000,,,,,-0.0300000
VSDSSDDLRDSQMK,ph,S,17,true,"TOR Kinase and ABA Receptor",100,29290610,XCorr,3.9762397,0.9198000,,,,2.4319999283762E-5,
VSDSSDDLRDSQMK,ph,S,17,true,"Phospho cell culture sucrose/TOR",109,30833711,,,0.9399060,,,,,
VSDSSDDLRDSQMK,ph,S,17,true,"Tissue atlas Arabidopsis - ProteomicsDB",114,32188942,"MaxQuant score",256.6200000,0.9915590,,,,0,
VSDSSDDLR,ph,S,17,true,"Large-scale phosphorylation discovery",44,23111157,XCorr,3.7180000,,,,,,
VSDSSDDLR,ph,S,17,true,"Chloroplast kinase substrates",60,19376835,"MASCOT Score",36.6300000,,,,,,0.8661570
VSDSSDDLR,ph,S,17,true,"LAXIC - ABA stress",84a,23660473,XCorr,2.5700000,0.9700000,,,,0.045744400471449,
VSDSSDDLR,ph,S,17,true,"LAXIC - mannitol vs control",84b,23660473,XCorr,2.1900000,0.8050000,,,,0.022359900176525,
VSDSSDDLR,ph,S,17,true,"atm and atr DNA damage response",88,25561503,"MASCOT Score",38.0000000,1.0000000,,,,,0.3900000
VSDSSDDLRDSQMK,ph,S,18,true,"atm and atr DNA damage response",88,25561503,"MASCOT Score",36.0000000,0.9340000,,,,,-0.1700000
ARSTENNNLTLR,ph,S,35,true,"Tissue atlas Arabidopsis - ProteomicsDB",114,32188942,"MaxQuant score",85.0060000,0.9307530,,,,0.0011904799612239,
QECLELPPVK,sno,C,188,true,"hot5-4 / wildtype, FAT-switch S-nitrosoproteome",169,37277371,,,,0.3007519,0.0025136,NO,,
ITAQEVVSSGSITKR,ac,K,229,true,"Quantitative Acetylproteomics",101,29440448,,,,,,,,
CGIDWDQK,sno,C,346,true,"hot5-4 / wildtype, FAT-switch S-nitrosoproteome",169,37277371,,,,,,,,
SVCTK,ox,C,434,false,"OxiTRAQ Arabidopsis - 5 mM H2O2 versus control",47,24376095,,,,-0.1983530,0.1190483,NO,,
KPGVGPSVCTK,sno,C,434,true,"hot5-4 / wildtype, FAT-switch S-nitrosoproteome",169,37277371,,,,,,,,
GFVGVLHNWCEPFPTYPR,ox,C,586,true,"OxiTRAQ SA and flg22 responses - SA vs mock",91a,25720653,"MASCOT Score",45.5100000,,0.9486008,0.0490000,YES,,
GFVGVLHNWCEPFPTYPR,ox,C,586,true,"OxiTRAQ SA and flg22 responses - flg22 vs mock",91b,25720653,"MASCOT Score",45.5100000,,0.8073549,0.0720000,NO,,
GFVGVLHNWCEPFPTYPR,ox,C,586,true,"Bicarbonate Induced Redox Changes - 5 min",117a,28184230,,,,-0.3400754,,YES,,
GFVGVLHNWCEPFPTYPR,ox,C,586,true,"Bicarbonate Induced Redox Changes - 30 min",117b,28184230,,,,0.1634987,,YES,,
