Peptide,PTM,ModifiedAA,ModifiedPosition,PeptideUniqueToGene,ExperimentDesc,ExpID,PubmedID,ScoreType,IdentScore,LocProb,Log2FChange,PQ-val,QuantSig,PEP,MassErrorPPM
KSHSGADKKKKKSSR,ac,K,102,true,"Quantitative Acetylproteomics",101,29440448,,,,,,,,
KSHSGADKKKKKSSR,ac,K,109,true,"Quantitative Acetylproteomics",101,29440448,,,,,,,,
SHSGADKKKKKSSR,ac,K,109,true,"Quantitative Acetylproteomics",101,29440448,,,,,,,,
SHSGADKKKKK,ac,K,109,true,"Histone deacetylases - apicidin vs control",98a,29061669,"MaxQuant Score",66.3000000,1.0000000,-3.0710000,0.0024831,YES,0.014000000432134,
SHSGADKKKKK,ac,K,109,true,"Histone deacetylases- hda14 vs WT (low light)",98c,29061669,"MaxQuant Score",142.8900000,1.0000000,0.0850000,0.9885531,NO,1.9999999494758E-5,
SHSGADKKKKK,ac,K,109,true,"Quantitative Acetylproteomics",101,29440448,,,,,,,,
SHSGADKKKK,ac,K,109,true,"Quantitative Acetylproteomics",101,29440448,,,,,,,,
SHSGADKKK,ac,K,109,true,"Quantitative Acetylproteomics",101,29440448,,,,,,,,
KSHSGADKKKKKSSR,ac,K,110,true,"Quantitative Acetylproteomics",101,29440448,,,,,,,,
SHSGADKKKKKSSR,ac,K,110,true,"Quantitative Acetylproteomics",101,29440448,,,,,,,,
SHSGADKKKKK,ac,K,110,true,"Histone deacetylases - apicidin vs control",98a,29061669,"MaxQuant Score",66.3000000,1.0000000,-3.0710000,0.0024831,YES,0.014000000432134,
SHSGADKKKKK,ac,K,110,true,"Histone deacetylases- hda14 vs WT (low light)",98c,29061669,"MaxQuant Score",142.8900000,1.0000000,0.0850000,0.9885531,NO,1.9999999494758E-5,
SHSGADKKKKK,ac,K,110,true,"Quantitative Acetylproteomics",101,29440448,,,,,,,,
SHSGADKKKK,ac,K,110,true,"Quantitative Acetylproteomics",101,29440448,,,,,,,,
SHSGADKKK,ac,K,110,true,"Quantitative Acetylproteomics",101,29440448,,,,,,,,
KSHSGADKKKKKSSR,ac,K,111,true,"Quantitative Acetylproteomics",101,29440448,,,,,,,,
SHSGADKKKKKSSR,ac,K,111,true,"Quantitative Acetylproteomics",101,29440448,,,,,,,,
SHSGADKKKKK,ac,K,111,true,"Histone deacetylases - apicidin vs control",98a,29061669,"MaxQuant Score",66.3000000,1.0000000,-3.0710000,0.0024831,YES,0.014000000432134,
SHSGADKKKKK,ac,K,111,true,"Histone deacetylases- hda14 vs WT (low light)",98c,29061669,"MaxQuant Score",142.8900000,1.0000000,0.0850000,0.9885531,NO,1.9999999494758E-5,
SHSGADKKKKK,ac,K,111,true,"Quantitative Acetylproteomics",101,29440448,,,,,,,,
SHSGADKKKK,ac,K,111,true,"Quantitative Acetylproteomics",101,29440448,,,,,,,,
KSHSGADKKKKKSSR,ac,K,112,true,"Quantitative Acetylproteomics",101,29440448,,,,,,,,
SHSGADKKKKKSSR,ac,K,112,true,"Quantitative Acetylproteomics",101,29440448,,,,,,,,
SHSGADKKKKK,ac,K,112,true,"Histone deacetylases - apicidin vs control",98a,29061669,"MaxQuant Score",66.3000000,1.0000000,-3.0710000,0.0024831,YES,0.014000000432134,
SHSGADKKKKK,ac,K,112,true,"Histone deacetylases- hda14 vs WT (low light)",98c,29061669,"MaxQuant Score",142.8900000,1.0000000,0.0850000,0.9885531,NO,1.9999999494758E-5,
SHSGADKKKKK,ac,K,112,true,"Quantitative Acetylproteomics",101,29440448,,,,,,,,
KSHSGADKKKKKSSR,ac,K,113,true,"Quantitative Acetylproteomics",101,29440448,,,,,,,,
SHSGADKKKKKSSR,ac,K,113,true,"Quantitative Acetylproteomics",101,29440448,,,,,,,,
KLLCNLCKVK,ub,K,398,true,"Protein ubiquitination during photomorphogenesis",3,28461270,,,,,,,,
KLLCNLCKVK,ub,K,405,true,"Protein ubiquitination during photomorphogenesis",3,28461270,,,,,,,,
HSDIQESGKSVEGGESNAAESR,ac,K,482,true,"Quantitative Acetylproteomics",101,29440448,,,,,,,,
NSDLQELESPHSK,ph,S,540,true,"atm and atr DNA damage response",88,25561503,"MASCOT Score",70.0000000,1.0000000,,,,,-0.5000000
NSDLQELESPHSK,ph,S,540,true,"Tissue atlas Arabidopsis - ProteomicsDB",114,32188942,"MaxQuant score",259.2900000,0.9998500,,,,0,
EGSVSLAPDHSPEEK,ph,S,653,true,"Tissue atlas Arabidopsis - ProteomicsDB",114,32188942,"MaxQuant score",167.2100000,0.9996610,,,,1.1568000098185E-17,
EGSVSLAPDHSPEEK,ph,S,661,true,"atm and atr DNA damage response",88,25561503,"MASCOT Score",37.0000000,1.0000000,,,,,-0.9100000
EGSVSLAPDHSPEEK,ph,S,661,true,"TOR Kinase and ABA Receptor",100,29290610,XCorr,2.4795909,0.8300000,,,,0.021649999544024,
EGSVSLAPDHSPEEK,ph,S,661,true,"Tissue atlas Arabidopsis - ProteomicsDB",114,32188942,"MaxQuant score",257.1200000,1.0000000,,,,0,
MAVSGPPSEK,ph,S,939,true,"srk2dei ABA signaling phopshoproteomics",83,23572148,"MASCOT Score",20.0000000,,,,,,0.0002000
MAVSGPPSEKR,ac,K,945,true,"Quantitative Acetylproteomics",101,29440448,,,,,,,,
GHPDSNISGSEAIQR,ph,S,1221,true,"Tissue atlas Arabidopsis - ProteomicsDB",114,32188942,"MaxQuant score",81.6060000,0.9989900,,,,0.00018328300211579,
GHPDSNISGSEAIQR,ph,S,1224,true,"Tissue atlas Arabidopsis - ProteomicsDB",114,32188942,"MaxQuant score",92.4270000,0.9738260,,,,7.0364600105677E-5,
SDDITIDSTVTDK,ph,S,1232,true,"Tissue atlas Arabidopsis - ProteomicsDB",114,32188942,"MaxQuant score",108.2300000,0.9999950,,,,0.00014656499843113,
TDDSATSKSR,ac,K,1266,true,"Quantitative Acetylproteomics",101,29440448,,,,,,,,
QILSGKTVPR,ac,K,1282,true,"Histone deacetylases - apicidin vs control",98a,29061669,"MaxQuant Score",95.6000000,1.0000000,-0.0730000,0.6576578,NO,0.003000000026077,
KHCIVSPSVSEDGDNGSKPK,ph,S,1292,true,"Tissue atlas Arabidopsis - ProteomicsDB",114,32188942,"MaxQuant score",112.8000000,0.9928820,,,,5.2439901379597E-12,
KHCIVSPSVSEDGDNGSKPK,ph,S,1296,true,"Tissue atlas Arabidopsis - ProteomicsDB",114,32188942,"MaxQuant score",112.8000000,0.9987210,,,,5.2439901379597E-12,
