Peptide,PTM,ModifiedAA,ModifiedPosition,PeptideUniqueToGene,ExperimentDesc,ExpID,PubmedID,ScoreType,IdentScore,LocProb,Log2FChange,PQ-val,QuantSig,PEP,MassErrorPPM
MKSASSEQSVER,nta,M,1,true,"Arabidopsis translation initiation landscape - NTA",167a,35069635,,,,,,,,
QSSVPIEDAHVEESLDGR,ph,S,35,true,"Tissue atlas Arabidopsis - ProteomicsDB",114,32188942,"MaxQuant score",44.8480000,0.8037440,,,,0.0023678899742663,
QSSVPIEDAHVEESLDGR,ph,S,46,true,"Tissue atlas Arabidopsis - ProteomicsDB",114,32188942,"MaxQuant score",56.6810000,0.9999270,,,,0.00038173299981281,
ASNVAFNSMPPMR,ph,S,86,true,"Tissue atlas Arabidopsis - ProteomicsDB",114,32188942,"MaxQuant score",134.9100000,1.0000000,,,,9.9119097285438E-6,
RSASPLLSSPEVSK,ph,S,100,true,"atm and atr DNA damage response",88,25561503,"MASCOT Score",33.0000000,1.0000000,,,,,-0.2800000
SASPLLSSPEVSK,ph,S,100,true,"Tissue atlas Arabidopsis - ProteomicsDB",114,32188942,"MaxQuant score",116.0000000,0.9998450,,,,3.8445701648016E-5,
RSASPLLSSPEVSK,ph,S,102,true,"Large-scale phosphorylation discovery",44,23111157,XCorr,3.6750000,,,,,,
RSASPLLSSPEVSK,ph,S,102,true,"atm and atr DNA damage response",88,25561503,"MASCOT Score",43.0000000,0.9520000,,,,,-0.4100000
RSASPLLSSPEVSK,ph,S,102,true,"TOR Kinase and ABA Receptor",100,29290610,XCorr,4.2208776,0.9995000,,,,2.8180000299471E-5,
SASPLLSSPEVSK,ph,S,102,true,"atm and atr DNA damage response",88,25561503,"MASCOT Score",58.0000000,1.0000000,,,,,0.1000000
SASPLLSSPEVSK,ph,S,102,true,"TOR Kinase and ABA Receptor",100,29290610,XCorr,3.2373581,0.9050000,,,,3.4450000384822E-5,
SASPLLSSPEVSK,ph,S,102,true,"Tissue atlas Arabidopsis - ProteomicsDB",114,32188942,"MaxQuant score",193.2700000,0.9998150,,,,1.2688499962748E-31,
RSASPLLSSPEVSK,ph,S,106,true,"Tissue atlas Arabidopsis - ProteomicsDB",114,32188942,"MaxQuant score",81.5940000,0.8139670,,,,0.00030955398688093,
GFVTESAAKPEGTNSPPEKDDK,ph,T,236,true,"Tissue atlas Arabidopsis - ProteomicsDB",114,32188942,"MaxQuant score",156.2000000,0.8014240,,,,7.7708300084707E-38,
GFVTESAAKPEGTNSPPEKDDK,ph,S,238,true,"Phospho cell culture sucrose/TOR",109,30833711,,,0.9555480,,,,,
GFVTESAAKPEGTNSPPEKDDK,ph,S,238,true,"Tissue atlas Arabidopsis - ProteomicsDB",114,32188942,"MaxQuant score",171.0000000,0.9788980,,,,0,
NGVTPSSPPSLDSCLGSFCEQK,ph,S,283,true,"Tissue atlas Arabidopsis - ProteomicsDB",114,32188942,"MaxQuant score",175.5200000,0.9987650,,,,5.6051938572993E-45,
