Peptide,PTM,ModifiedAA,ModifiedPosition,PeptideUniqueToGene,ExperimentDesc,ExpID,PubmedID,ScoreType,IdentScore,LocProb,Log2FChange,PQ-val,QuantSig,PEP,MassErrorPPM
HMLSQQTPGTPRTPRTPR,ph,T,307,true,"Tissue atlas Arabidopsis - ProteomicsDB",114,32188942,"MaxQuant score",180.3000000,0.9540780,,,,9.8565400688095E-20,
HMLSQQTPGTPR,ph,T,307,true,"Lateral root-induction - NAA vs control",106,23328941,"MASCOT Score",32.0000000,,,,,,
HMLSQQTPGTPRTPRTPR,ph,T,310,true,"atm and atr DNA damage response",88,25561503,"MASCOT Score",21.0000000,1.0000000,,,,,-0.3900000
HMLSQQTPGTPRTPR,ph,T,310,true,"atm and atr DNA damage response",88,25561503,"MASCOT Score",23.0000000,1.0000000,,,,,-0.0100000
HMLSQQTPGTPR,ph,T,310,true,"atm and atr DNA damage response",88,25561503,"MASCOT Score",38.0000000,1.0000000,,,,,-0.1700000
HMLSQQTPGTPR,ph,T,310,true,"Lateral root-induction - NAA vs control",106,23328941,"MASCOT Score",29.0000000,,,,,,
HMLSQQTPGTPR,ph,T,310,true,"Tissue atlas Arabidopsis - ProteomicsDB",114,32188942,"MaxQuant score",257.0400000,0.9999920,,,,0,
HMLSQQTPGTPRTPRTPR,ph,T,313,true,"atm and atr DNA damage response",88,25561503,"MASCOT Score",21.0000000,1.0000000,,,,,-0.3900000
HMLSQQTPGTPRTPR,ph,T,313,true,"atm and atr DNA damage response",88,25561503,"MASCOT Score",23.0000000,1.0000000,,,,,-0.0100000
HMLSQQTPGTPRTPR,ph,T,313,true,"Tissue atlas Arabidopsis - ProteomicsDB",114,32188942,"MaxQuant score",143.9300000,0.9999990,,,,1.3080400255692E-16,
HMLSQQTPGTPRTPRTPR,ph,T,316,true,"atm and atr DNA damage response",88,25561503,"MASCOT Score",21.0000000,1.0000000,,,,,-0.3900000
HMLSQQTPGTPRTPRTPR,ph,T,316,true,"Tissue atlas Arabidopsis - ProteomicsDB",114,32188942,"MaxQuant score",143.9300000,0.9999300,,,,1.3080400255692E-16,
