Peptide,PTM,ModifiedAA,ModifiedPosition,PeptideUniqueToGene,ExperimentDesc,ExpID,PubmedID,ScoreType,IdentScore,LocProb,Log2FChange,PQ-val,QuantSig,PEP,MassErrorPPM
AASDAAQLISAKEDIKVLLR,nt,A,79,true,"Stromal N-terminome",96,26371235,"MASCOT Score",38.6400000,,,,,,
AASDAAQLISAKEDIKVLLR,nt,A,79,true,"Arabidopsis translation initiation landscape - NT",167b,35069635,,,,,,,,
AASDAAQLISAKED,nt,A,79,true,"HUNTER N-terminome: legumain, GluC and trypsin",119,31951383,"MaxQuant score",146.5000000,,,,,,
AASDAAQLISAKE,nt,A,79,true,"N-terminal ChaFRADIC",92,26010716,"MASCOT Score",75.9600000,,,,,0.0012029999634251,
AASDAAQLISAKE,nt,A,79,true,"HUNTER N-terminome: legumain, GluC and trypsin",119,31951383,"MaxQuant score",165.7000000,,,,,,
AASDAAQLISAK,nt,A,79,true,"N-terminal ChaFRADIC",92,26010716,"MASCOT Score",29.9200000,,,,,0.059749998152256,
AASDAAQLISAKE,nta,A,79,true,"N-terminal ChaFRADIC",92,26010716,"MASCOT Score",75.9600000,,,,,0.0012029999634251,
ASDAAQLISAKE,nt,A,80,true,"N-terminal ChaFRADIC",92,26010716,"MASCOT Score",31.0700000,,,,,5.6720000429777E-5,
EDIKVLLR,ac,K,94,true,"Histone deacetylases - apicidin vs control",98a,29061669,"MaxQuant Score",111.6000000,1.0000000,0.0070000,0.9840111,NO,0.0040000001899898,
EDIKVLLR,ac,K,94,true,"Quantitative Acetylproteomics",101,29440448,,,,,,,,
TKFCHPILVR,ac,K,100,false,"Histone deacetylases - apicidin vs control",98a,29061669,"MaxQuant Score",58.6000000,1.0000000,0.3740000,0.1918669,NO,0.0020000000949949,
FCHPILVR,ox,C,102,false,"Redox kickstart of mitochondria",112,31871212,,,,-1.2018294,0.0026101,YES,,
FCHPILVR,so,C,102,false,"Arabidopsis S-sulfenylation chemoproteomics",108,31578252,"pFind PSM Score",0.1010240,,1.5337000,,,,1.0236407
FEAELKHAANAGLLNALK,ac,K,141,true,"Histone deacetylases - hda14 vs WT (thylakoids)",98d,29061669,"MaxQuant Score",150.9000000,1.0000000,0.8290000,0.2917427,NO,2.7300000103001E-18,
FEAELKHAANAGLLNALK,ac,K,141,true,"Quantitative Acetylproteomics",101,29440448,,,,,,,,
VDVVAPEQCPEEGRLPDAGPPSPADHLR,ph,S,215,true,"Tissue atlas Arabidopsis - ProteomicsDB",114,32188942,"MaxQuant score",64.6850000,1.0000000,,,,7.5130799359613E-7,
LPDAGPPSPADHLR,ph,S,215,true,"atm and atr DNA damage response",88,25561503,"MASCOT Score",57.0000000,1.0000000,,,,,-0.3800000
MGLDDKEIVALSGAHTLGR,nt,M,227,true,"N-terminal ChaFRADIC",92,26010716,"MASCOT Score",27.9500000,,,,,2.221999966423E-5,
MGLDDKEIVALSGAHTLGR,nta,M,227,true,"N-terminal ChaFRADIC",92,26010716,"MASCOT Score",27.9500000,,,,,2.221999966423E-5,
MGLDDKEIVALSGAHTLGR,ac,K,232,true,"Histone deacetylases substrates - hda14 vs WT",98e,29061669,"MaxQuant Score",73.3000000,1.0000000,-0.0060000,0.9954054,NO,2.9000000623114E-8,
YTKTGPGEAGGQSWTVK,ac,K,262,true,"Quantitative Acetylproteomics",101,29440448,,,,,,,,
TGPGEAGGQSWTVKWLK,ac,K,276,true,"Histone deacetylases - hda14 vs WT (thylakoids)",98d,29061669,"MaxQuant Score",74.2000000,1.0000000,-0.4040000,0.8550667,NO,2.2300000637188E-6,
FDNSYFKDIK,ac,K,286,true,"Histone deacetylases - hda14 vs WT (thylakoids)",98d,29061669,"MaxQuant Score",103.4000000,1.0000000,-0.0100000,0.9977001,NO,0.0049999998882413,
FDNSYFKDIK,ac,K,286,true,"Histone deacetylases substrates - hda14 vs WT",98e,29061669,"MaxQuant Score",52.2000000,1.0000000,0.2060000,0.7227698,NO,0.0080000003799796,
FDNSYFKDIK,ac,K,286,true,"Quantitative Acetylproteomics",101,29440448,,,,,,,,
YAEDVAAFFKDYAEAHAK,ac,K,327,true,"Histone deacetylases - hda14 vs WT (thylakoids)",98d,29061669,"MaxQuant Score",75.7000000,1.0000000,1.7720000,0.8394600,NO,1.5000000130883E-9,
FDPPEGIVIENVPEKFVAAK,ac,K,357,true,"Histone deacetylases - hda14 vs WT (thylakoids)",98d,29061669,"MaxQuant Score",58.9000000,1.0000000,1.8970000,0.2018366,NO,8.1300004239893E-6,
FVAAKYSTGK,ac,K,362,true,"Histone deacetylases- hda14 vs WT (low light)",98c,29061669,"MaxQuant Score",152.5400000,1.0000000,5.5620000,0.0835603,NO,0.00076000002445653,
FVAAKYSTGK,ac,K,362,true,"Histone deacetylases - hda14 vs WT (thylakoids)",98d,29061669,"MaxQuant Score",117.5000000,1.0000000,6.1010000,0.0221309,YES,0.0020000000949949,
FVAAKYSTGK,ac,K,362,true,"Histone deacetylases substrates - hda14 vs WT",98e,29061669,"MaxQuant Score",145.5000000,1.0000000,4.9410000,0.0210863,YES,3.3999999678334E-23,
ELSDSMKK,ph,S,373,true,"atm and atr DNA damage response",88,25561503,"MASCOT Score",44.0000000,0.9930000,,,,,-4.6300000
