Peptide,PTM,ModifiedAA,ModifiedPosition,PeptideUniqueToGene,ExperimentDesc,ExpID,PubmedID,ScoreType,IdentScore,LocProb,Log2FChange,PQ-val,QuantSig,PEP,MassErrorPPM
STTGQIIRCKAAVAWE,nt,S,2,true,"Arg/N-end rule seed, prt6 vs. Wt",99,29168982,"MASCOT Score",20.3300000,,,,,2.2899999748915E-5,-0.3805309
STTGQIIRC,nt,S,2,true,"Arg/N-end rule seed, prt6 vs. Wt",99,29168982,"MASCOT Score",57.9200000,,,,,0.0026779999025166,-0.5164112
STTGQIIR,nt,S,2,true,"Arg/N-end rule seed, prt6 vs. Wt",99,29168982,"MASCOT Score",62.7100000,,,,,0.1676000058651,-0.5243184
STTGQIIR,nt,S,2,true,"FtsH12 N-terminome: WT / FtsH12 knockdown miRNA",118,33216923,"MaxQuant score",78.1910000,,0.1158492,0.4876944,NO,2.4499999933364E-18,
STTGQIIRCKAAVAWE,nta,S,2,true,"Arg/N-end rule seed, prt6 vs. Wt",99,29168982,"MASCOT Score",20.3300000,,1.6411934,0.0001864,YES,2.2899999748915E-5,-0.3805309
STTGQIIRCKAAVAWE,nta,S,2,true,"Arabidopsis translation initiation landscape - NTA",167a,35069635,,,,,,,,
STTGQIIRC,nta,S,2,true,"Arg/N-end rule seed, prt6 vs. Wt",99,29168982,"MASCOT Score",57.9200000,,,,,0.0026779999025166,-0.5164112
STTGQIIR,nta,S,2,true,"Characterization plant N-terminal acetylation",6,22223895,"MASCOT Score",60.0700000,,,,,,
STTGQIIR,nta,S,2,true,"Arg/N-end rule seed, prt6 vs. Wt",99,29168982,"MASCOT Score",62.7100000,,,,,0.1676000058651,-0.5243184
STTGQIIRCK,so,C,10,true,"S-sulfenylation site detection using YAP1C",110,32714340,,,,,,,,
TSLCHTDVYFWEAK,so,C,47,true,"Arabidopsis S-sulfenylation chemoproteomics",108,31578252,"pFind PSM Score",0.1524500,,,,,,-1.4094107
GQTPLFPR,ph,T,60,true,"Tyrosine phosphorylation in Arabidopsis",59,18463617,"MASCOT Score",39.0000000,,,,,,-1.0055682
GQTPLFPR,ph,T,60,true,"Phospho cell culture sucrose/TOR",109,30833711,,,1.0000000,,,,,
SVGEGVTDLQPGDHVLPIFTGECGE,nt,S,77,true,"N-terminal ChaFRADIC",92,26010716,"MASCOT Score",30.1600000,,,,,5.8969999372493E-7,
SVGEGVTDLQPGDHVLPIFTGE,nt,S,77,true,"N-terminal ChaFRADIC",92,26010716,"MASCOT Score",43.6400000,,,,,5.256999805088E-13,
SVGEGVTDLQPGDHVLPIFTGE,nt,S,77,true,"Arabidopsis translation initiation landscape - NT",167b,35069635,,,,,,,,
SVGEGVTDLQPGDHVLPIFTG,nt,S,77,true,"N-terminal ChaFRADIC",92,26010716,"MASCOT Score",30.7500000,,,,,5.7639999137592E-15,
SVGEGVTDLQPGDHVLPIFT,nt,S,77,true,"N-terminal ChaFRADIC",92,26010716,"MASCOT Score",26.0300000,,,,,6.7400002246032E-11,
SVGEGVTDLQPG,nt,S,77,true,"N-terminal ChaFRADIC",92,26010716,"MASCOT Score",85.4300000,,,,,3.6340000453272E-10,
SNMCDLLRINTE,nt,S,110,true,"N-terminal ChaFRADIC",92,26010716,"MASCOT Score",58.6700000,,,,,0.010459999553859,
GGMIHDGESR,nt,G,123,true,"Arabidopsis translation initiation landscape - NT",167b,35069635,,,,,,,,
SRFSINGKPIYHFLGTSTFSE,nt,S,131,true,"Arabidopsis translation initiation landscape - NT",167b,35069635,,,,,,,,
SINGKPIYHFLGTSTF,nt,S,134,true,"Arabidopsis translation initiation landscape - NT",167b,35069635,,,,,,,,
INPDAPLDKVCIVSCGLSTGLGATLNVAKPK,ub,K,171,true,"Arabidopsis ubiquitination by TUBEs",2,23667124,,,,,,,,
VCIVSCGLSTGLGATLNVAKPK,so,C,173,true,"S-sulfenylation site detection using YAP1C",110,32714340,,,,,,,,
VCIVSCGLSTGLGATLNVAKPK,so,C,177,true,"S-sulfenylation site detection using YAP1C",110,32714340,,,,,,,,
KGQSVAIFGLGAVGLGAAEGAR,ub,K,194,true,"upl3 mutant / wildtype",168,35926874,"MaxQuant score",78.4280000,1.0000000,0.6897464,0.0672770,NO,3.3865699151647E-6,-1.7082000
SVAIFGLGAVGLGAAEGAR,nt,S,197,true,"Arabidopsis translation initiation landscape - NT",167b,35069635,,,,,,,,
AVGLGAAEGAR,nt,A,205,true,"Arg/N-end rule seed, prt6 vs. Wt",99,29168982,"MASCOT Score",60.3300000,,2.0934052,0.0041000,YES,0.0062179998494685,-1.9369746
AVGLGAAEGAR,nt,A,205,true,"Arabidopsis translation initiation landscape - NT",167b,35069635,,,,,,,,
IIGVDFNSKRFDQAK,ph,S,229,true,"Ethylene-regulated phosphorylation ein2 mutant",30,19253305,"MASCOT Score",50.5747000,,,,,,-19.3497140
IIGVDFNSKRFDQAK,ph,S,229,true,"PAMP-triggered phosphorylation",48,24601666,"MASCOT Score",48.8300000,,,,,,
IIGVDFNSKRFDQAK,ph,S,229,true,"Tissue atlas Arabidopsis - ProteomicsDB",114,32188942,"MaxQuant score",226.3100000,1.0000000,,,,0,
IIGVDFNSKR,ph,S,229,true,"Phosphoproteome iron-deficient Arabidopsis roots",41,22438062,"MASCOT Score",36.1500000,,,,,,
IIGVDFNSKR,ph,S,229,true,"PAMP-triggered phosphorylation",48,24601666,"MASCOT Score",48.1200000,,,,,,
IIGVDFNSKR,ph,S,229,true,"SnRK2 protein kinase substrates",85,23776212,XCorr,2.4837809,1.0000000,,,,3.1271101761376E-5,
IIGVDFNSKR,ph,S,229,true,"atm and atr DNA damage response",88,25561503,"MASCOT Score",43.0000000,1.0000000,,,,,0.1100000
IIGVDFNSKR,ph,S,229,true,"Phospho cell culture sucrose/TOR",109,30833711,,,1.0000000,,,,,
IIGVDFNSKR,ph,S,229,true,"Col-0 callus - FC Col-0 vs. Col-0 Xray",111a,31410901,,61.1800000,,0.2157243,0.0000000,NO,,0.1912526
IIGVDFNSKR,ph,S,229,true,"Col-0 X-ray callus - FC Col-0 vs. Col-0 Xray",111b,31410901,,61.1800000,,0.2157243,0.0000000,NO,,0.1912526
IIGVDFNSKR,ph,S,229,true,"atm callus - FC atm vs. atm Xray",111c,31410901,,61.1800000,,0.5091152,0.0000000,NO,,0.1912526
IIGVDFNSKR,ph,S,229,true,"atm-3 X-ray callus - FC atm vs. atm Xray",111d,31410901,,61.1800000,,0.5091152,0.0000000,NO,,0.1912526
IIGVDFNSK,ph,S,229,true,"Phosphoproteome iron-deficient Arabidopsis roots",41,22438062,"MASCOT Score",53.0100000,,,,,,
IIGVDFNSK,ph,S,229,true,"PAMP-triggered phosphorylation",48,24601666,"MASCOT Score",34.8000000,,,,,,
IIGVDFNSK,ph,S,229,true,"Tyrosine phosphorylation in Arabidopsis",59,18463617,"MASCOT Score",36.0000000,,,,,,-0.5599630
IIGVDFNSK,ph,S,229,true,"srk2dei ABA signaling phopshoproteomics",83,23572148,"MASCOT Score",58.0000000,,,,,,0.0001000
IIGVDFNSK,ph,S,229,true,"SnRK2 protein kinase substrates",85,23776212,XCorr,2.1974733,1.0000000,,,,0.0077560599893332,
IIGVDFNSK,ph,S,229,true,"SIRK1 phosphorylation",86a,23820729,"MaxQuant Score",117.1000000,1.0000000,,,,0.029999999329448,4.2610000
IIGVDFNSK,ph,S,229,true,"SIRK1 exp - sirk1 mutant vs WT",86b,23820729,,,,-1.2397937,,NO,,
IIGVDFNSK,ph,S,229,true,"SIRK1 exp - 35S:SIRK1 vs WT",86c,23820729,,,,0.3104062,,NO,,
IIGVDFNSK,ph,S,229,true,"atm and atr DNA damage response",88,25561503,"MASCOT Score",53.0000000,1.0000000,,,,,-1.1000000
IIGVDFNSK,ph,S,229,true,"Brassinosteroid-Regulated Phosphorylation Dynamics",94,26187819,"MaxQuant Score",86.7720000,1.0000000,,,,0.014999999664724,0.9890000
IIGVDFNSKR,ac,K,230,true,"Quantitative Acetylproteomics",101,29440448,,,,,,,,
IIGVDFNSKR,ub,K,230,true,"Arabidopsis ubiquitination COFRADIC",40,26744219,"MaxQuant Score",132.8800000,1.0000000,,,,8.8040002310663E-7,0.1950000
EFGVTECVNPK,ox,C,243,true,"OxiTRAQ Arabidopsis - 5 mM H2O2 versus control",47,24376095,,,,-0.0327974,0.2743569,NO,,
EFGVTECVNPK,sno,C,243,true,"Endogenous S-nitrosylation in Arabidopsis",64,22115780,"MASCOT Score",57.0000000,,,,,,
EFGVTECVNPK,sno,C,243,true,"hot5-4 / wildtype, FAT-switch S-nitrosoproteome",169,37277371,,,,,,,,
EFGVTECVNPKDHDKPIQQVIAEMTDGGVDR,so,C,243,true,"S-sulfenylation site detection using YAP1C",110,32714340,,,,,,,,
EFGVTECVNPK,so,C,243,true,"Arabidopsis S-sulfenylation chemoproteomics",108,31578252,"pFind PSM Score",0.0009845,,1.0287300,,,,-1.1811312
MTDGGVDRSVE,nt,M,260,true,"Arabidopsis translation initiation landscape - NT",167b,35069635,,,,,,,,
ERTLKGTFFGNYKPKT,nt,E,314,true,"Arabidopsis translation initiation landscape - NT",167b,35069635,,,,,,,,
GTFFGNYKPKTDIPGVVEK,ac,K,328,true,"Quantitative Acetylproteomics",101,29440448,,,,,,,,
YMNKELELEK,ac,K,341,true,"Quantitative Acetylproteomics",101,29440448,,,,,,,,
SIRCIITMGA,nt,S,370,true,"Arabidopsis translation initiation landscape - NT",167b,35069635,,,,,,,,
GESIRCIITMGA,so,C,373,true,"S-sulfenylation site detection using YAP1C",110,32714340,,,,,,,,
