Peptide,PTM,ModifiedAA,ModifiedPosition,PeptideUniqueToGene,ExperimentDesc,ExpID,PubmedID,ScoreType,IdentScore,LocProb,Log2FChange,PQ-val,QuantSig,PEP,MassErrorPPM
IQVDDDVISLDGMDPLRTETETDVNGR,ph,S,184,true,"Phosphorylation Early Elicitor Signaling",23,17317660,,,,,,,,
IQVDDDVISLDGMDPLR,ph,S,184,true,"Phosphorylation Early Elicitor Signaling",23,17317660,,,,,,,,
SVSSVPDSVMSSSLCLTPR,ph,T,226,true,"Tissue atlas Arabidopsis - ProteomicsDB",114,32188942,"MaxQuant score",149.9400000,0.9986920,,,,1.3571799637161E-17,
RLSGYASSDAYSLQPTPR,ph,T,304,true,"Tissue atlas Arabidopsis - ProteomicsDB",114,32188942,"MaxQuant score",74.2870000,0.9960440,,,,9.216379839927E-5,
LSGYASSDAYSLQPTPR,ph,T,304,true,"Phosphorylation Early Elicitor Signaling",23,17317660,,,,,,,,
EISFRDALK,ph,S,363,true,"Phosphorylation Early Elicitor Signaling",23,17317660,,,,,,,,
AAPQATAAGGGASMEEGAAGKDTTPVAAIGK,ph,T,393,true,"Phosphorylation Early Elicitor Signaling",23,17317660,,,,,,,,
DTTPVAAIGK,ph,T,393,true,"Tissue atlas Arabidopsis - ProteomicsDB",114,32188942,"MaxQuant score",107.5500000,0.9999080,,,,3.9044198770646E-17,
