Peptide,PTM,ModifiedAA,ModifiedPosition,PeptideUniqueToGene,ExperimentDesc,ExpID,PubmedID,ScoreType,IdentScore,LocProb,Log2FChange,PQ-val,QuantSig,PEP,MassErrorPPM
DGTSPANELESHIQTNK,ph,T,245,true,"atm and atr DNA damage response",88,25561503,"MASCOT Score",41.0000000,0.9940000,,,,,0.4700000
DGTSPANELESHIQTNK,ph,S,246,true,"Tissue atlas Arabidopsis - ProteomicsDB",114,32188942,"MaxQuant score",242.8500000,0.9995310,,,,0,
CLCNPAFDVDDDEIVYKGK,acy,C,361,true,"Arabidopsis S-acylation atlas - Meristem",163a,35681017,,,,,,,,
CLCNPAFDVDDDEIVYKGK,acy,C,361,true,"Arabidopsis S-acylation atlas - Seedling",163d,35681017,,,,,,,,
CLCNPAFDVDDDEIVYKGK,acy,C,361,true,"Arabidopsis S-acylation atlas - Silique",163e,35681017,,,,,,,,
CLCNPAFDVDDDEIVYK,acy,C,361,true,"Arabidopsis S-acylation atlas - Meristem",163a,35681017,,,,,,,,
CLCNPAFDVDDDEIVYKGK,acy,C,363,true,"Arabidopsis S-acylation atlas - Meristem",163a,35681017,,,,,,,,
CLCNPAFDVDDDEIVYKGK,acy,C,363,true,"Arabidopsis S-acylation atlas - Seedling",163d,35681017,,,,,,,,
CLCNPAFDVDDDEIVYKGK,acy,C,363,true,"Arabidopsis S-acylation atlas - Silique",163e,35681017,,,,,,,,
CLCNPAFDVDDDEIVYK,acy,C,363,true,"Arabidopsis S-acylation atlas - Meristem",163a,35681017,,,,,,,,
