Peptide,PTM,ModifiedAA,ModifiedPosition,PeptideUniqueToGene,ExperimentDesc,ExpID,PubmedID,ScoreType,IdentScore,LocProb,Log2FChange,PQ-val,QuantSig,PEP,MassErrorPPM
SSDSNDLDEDELLQMALKEQAKR,nta,S,2,true,"Arabidopsis translation initiation landscape - NTA",167a,35069635,,,,,,,,
SSDSNDLDEDELLQMALK,ph,S,2,true,"atm and atr DNA damage response",88,25561503,"MASCOT Score",27.0000000,0.8870000,,,,,0.2100000
DLTYQKPPSSSAR,ub,K,30,true,"Arabidopsis ubiquitination COFRADIC",40,26744219,"MaxQuant Score",45.2800000,1.0000000,,,,0.0010000000474975,0.4120000
RDLTYQKPPSSSAR,ph,S,33,true,"TOR Kinase and ABA Receptor",100,29290610,XCorr,2.5768499,0.8691000,,,,0.0040070000104606,
DLTYQKPPSSSAR,ph,S,33,true,"atm and atr DNA damage response",88,25561503,"MASCOT Score",33.0000000,0.9330000,,,,,-1.1500000
DLTYQKPPSSSAR,ph,S,33,true,"Tissue atlas Arabidopsis - ProteomicsDB",114,32188942,"MaxQuant score",175.2700000,0.9850300,,,,4.4533299302981E-15,
DLTYQKPPSSSAR,ph,S,35,true,"Brassinosteroid-Regulated Phosphorylation Dynamics",94,26187819,"MaxQuant Score",114.2400000,1.0000000,,,,0.00068539998028427,5.9110000
EIGGSSGGAGR,ph,S,101,true,"atm and atr DNA damage response",88,25561503,"MASCOT Score",75.0000000,0.9240000,,,,,0.1700000
VALTSLQSLPR,ph,T,176,true,"MAPK Arabidopsis substrates",45,23172892,"MaxQuant Score",169.5200000,,,,,,
VALTSLQSLPR,ph,T,176,true,"BSK8 and BSL2 regulating sucrose-ph synthase",66,24924143,"MaxQuant Score",137.6800000,,,,,,0.4179100
VALTSLQSLPR,ph,T,176,true,"Tissue atlas Arabidopsis - ProteomicsDB",114,32188942,"MaxQuant score",253.8800000,0.9955790,,,,0,
VALTSLQSLPR,ph,S,177,true,"srk2dei ABA signaling phopshoproteomics",83,23572148,"MASCOT Score",50.0000000,,,,,,-0.0001000
VALTSLQSLPR,ph,S,177,true,"SIRK1 phosphorylation",86a,23820729,"MaxQuant Score",102.2700000,0.7670000,,,,0.059000000357628,7.9020000
VALTSLQSLPR,ph,S,177,true,"atm and atr DNA damage response",88,25561503,"MASCOT Score",38.0000000,0.9960000,,,,,-0.4000000
VALTSLQSLPR,ph,S,177,true,"Lateral root-induction - NAA vs control",106,23328941,"MASCOT Score",39.0000000,,,,,,
KVALTSLQSLPR,ph,S,180,true,"atm and atr DNA damage response",88,25561503,"MASCOT Score",48.0000000,0.9990000,,,,,-0.7800000
VALTSLQSLPR,ph,S,180,true,"Arabidopsis root NAA phosphoproteome",18a,27643528,"MaxQuant Score",158.9300000,1.0000000,,,,4.1740000344959E-10,-0.5330000
VALTSLQSLPR,ph,S,180,true,"STN8 phosphoproteome",38,21768351,"MASCOT Score",46.0500000,,,,,,-0.6505490
VALTSLQSLPR,ph,S,180,true,"PAMP-triggered phosphorylation",48,24601666,"MASCOT Score",50.0000000,,,,,,
VALTSLQSLPR,ph,S,180,true,"Tyrosine phosphorylation in Arabidopsis",59,18463617,"MASCOT Score",59.0000000,,,,,,-0.4748119
VALTSLQSLPR,ph,S,180,true,"Chloroplast kinase substrates",60,19376835,"MASCOT Score",38.4700000,,,,,,-0.1290870
VALTSLQSLPR,ph,S,180,true,"Conserved plant phosphoproteome - Arabidopsis",61a,20466843,"MASCOT Score",59.0000000,1.0000000,,,,,
VALTSLQSLPR,ph,S,180,true,"BSK8 and BSL2 regulating sucrose-ph synthase",66,24924143,"MaxQuant Score",140.2700000,,,,,,-0.1747800
VALTSLQSLPR,ph,S,180,true,"srk2dei ABA signaling phopshoproteomics",83,23572148,"MASCOT Score",76.0000000,,,,,,-0.0002000
VALTSLQSLPR,ph,S,180,true,"SnRK2 protein kinase substrates",85,23776212,XCorr,3.4343212,1.0000000,,,,1.1903500407584E-9,
VALTSLQSLPR,ph,S,180,true,"SIRK1 phosphorylation",86a,23820729,"MaxQuant Score",126.7700000,0.9100000,,,,0.0089999996125698,-0.2110000
VALTSLQSLPR,ph,S,180,true,"SIRK1 exp - sirk1 mutant vs WT",86b,23820729,,,,-0.7209920,,NO,,
VALTSLQSLPR,ph,S,180,true,"SIRK1 exp - 35S:SIRK1 vs WT",86c,23820729,,,,-0.1921248,,NO,,
VALTSLQSLPR,ph,S,180,true,"atm and atr DNA damage response",88,25561503,"MASCOT Score",68.0000000,0.9960000,,,,,-1.2700000
VALTSLQSLPR,ph,S,180,true,"Brassinosteroid-Regulated Phosphorylation Dynamics",94,26187819,"MaxQuant Score",118.1300000,0.9940000,,,,0.0060000000521541,1.3560000
VALTSLQSLPR,ph,S,180,true,"TOR Kinase and ABA Receptor",100,29290610,XCorr,4.3178315,0.9977000,,,,2.8679999104497E-6,
VALTSLQSLPR,ph,S,180,true,"Lateral root-induction - NAA vs control",106,23328941,"MASCOT Score",61.0000000,,,,,,
VALTSLQSLPR,ph,S,180,true,"Phospho cell culture sucrose/TOR",109,30833711,,,0.9988730,,,,,
VALTSLQSLPR,ph,S,180,true,"Col-0 callus - FC Col-0 vs. Col-0 Xray",111a,31410901,,79.7500000,,0.8941301,0.0000000,NO,,0.1725531
VALTSLQSLPR,ph,S,180,true,"Col-0 X-ray callus - FC Col-0 vs. Col-0 Xray",111b,31410901,,79.7500000,,0.8941301,0.0000000,NO,,0.1725531
VALTSLQSLPR,ph,S,180,true,"atm callus - FC atm vs. atm Xray",111c,31410901,,79.7500000,,0.0290883,0.0000000,NO,,0.1725531
VALTSLQSLPR,ph,S,180,true,"atm-3 X-ray callus - FC atm vs. atm Xray",111d,31410901,,79.7500000,,0.0290883,0.0000000,NO,,0.1725531
VALTSLQSLPR,ph,S,180,true,"Tissue atlas Arabidopsis - ProteomicsDB",114,32188942,"MaxQuant score",276.4100000,1.0000000,,,,0,
LQSLPR,ph,S,180,false,"STN8 phosphoproteome",38,21768351,"MASCOT Score",37.9600000,,,,,,1.8600300
GMECIDPLK,sno,C,187,false,"hot5-4 / wildtype, FAT-switch S-nitrosoproteome",169,37277371,,,,0.0070619,0.9177042,NO,,
LITESSGSPSK,ph,T,205,true,"atm and atr DNA damage response",88,25561503,"MASCOT Score",39.0000000,0.9880000,,,,,-0.1700000
LITESSGSPSKAEK,ph,S,208,true,"LAXIC - mannitol vs control",84b,23660473,XCorr,3.9000000,0.9310000,,,,0.00030539400177076,
LITESSGSPSKAEK,ph,S,208,true,"atm and atr DNA damage response",88,25561503,"MASCOT Score",32.0000000,0.9920000,,,,,1.8800000
LITESSGSPSKAEK,ph,S,208,true,"Phospho cell culture sucrose/TOR",109,30833711,,,0.8823430,,,,,
LITESSGSPSKAEK,ph,S,208,true,"Tissue atlas Arabidopsis - ProteomicsDB",114,32188942,"MaxQuant score",223.1500000,0.9993820,,,,0,
LITESSGSPSK,ph,S,208,true,"atm and atr DNA damage response",88,25561503,"MASCOT Score",68.0000000,0.9960000,,,,,-0.4000000
LITESSGSPSK,ph,S,208,true,"Lateral root-induction - NAA vs control",106,23328941,"MASCOT Score",21.0000000,,,,,,
LITESSGSPSKAEK,ph,S,210,true,"SnRK2 protein kinase substrates",85,23776212,XCorr,4.6725268,0.9940000,,,,5.3487799078766E-8,
LITESSGSPSKAEK,ph,S,210,true,"atm and atr DNA damage response",88,25561503,"MASCOT Score",47.0000000,1.0000000,,,,,0.9000000
LITESSGSPSKAEK,ph,S,210,true,"Tissue atlas Arabidopsis - ProteomicsDB",114,32188942,"MaxQuant score",266.4500000,0.9997450,,,,0,
LITESSGSPSK,ph,S,210,true,"Phytohormone-responsive phosphoproteins",34,20374526,"MASCOT Score",43.0000000,,,,,,
LITESSGSPSK,ph,S,210,true,"Chloroplast kinase substrates",60,19376835,"MASCOT Score",36.6200000,,,,,,-0.3947440
LITESSGSPSK,ph,S,210,true,"LAXIC - mannitol vs control",84b,23660473,XCorr,3.3300000,0.9830000,,,,3.9599999581696E-6,
LITESSGSPSK,ph,S,210,true,"SnRK2 protein kinase substrates",85,23776212,XCorr,2.9254177,0.9910000,,,,1.8217300521428E-6,
LITESSGSPSK,ph,S,210,true,"atm and atr DNA damage response",88,25561503,"MASCOT Score",67.0000000,0.9360000,,,,,0.8400000
LITESSGSPSK,ph,S,210,true,"TOR Kinase and ABA Receptor",100,29290610,XCorr,3.7554750,0.9153000,,,,3.9609999475942E-6,
LITESSGSPSK,ph,S,210,true,"Lateral root-induction - NAA vs control",106,23328941,"MASCOT Score",33.0000000,,,,,,
LITESSGSPSK,ph,S,210,true,"Phospho cell culture sucrose/TOR",109,30833711,,,0.9048370,,,,,
LITESSGSPSK,ph,S,210,true,"Col-0 callus - FC Col-0 vs. Col-0 Xray",111a,31410901,,47.5000000,,-0.0413499,0.0000000,NO,,-0.1013296
LITESSGSPSK,ph,S,210,true,"Col-0 X-ray callus - FC Col-0 vs. Col-0 Xray",111b,31410901,,47.5000000,,-0.0413499,0.0000000,NO,,-0.1013296
LITESSGSPSK,ph,S,210,true,"atm callus - FC atm vs. atm Xray",111c,31410901,,47.5000000,,-1.2839714,0.0000000,NO,,-0.1013296
LITESSGSPSK,ph,S,210,true,"atm-3 X-ray callus - FC atm vs. atm Xray",111d,31410901,,47.5000000,,-1.2839714,0.0000000,NO,,-0.1013296
LITESSGSPSKAEK,ph,S,212,true,"LAXIC - mannitol vs control",84b,23660473,XCorr,3.9000000,0.9370000,,,,0.00030539400177076,
LITESSGSPSKAEK,ph,S,212,true,"Col-0 callus - FC Col-0 vs. Col-0 Xray",111a,31410901,,66.2800000,,0.9168967,0.0000000,NO,,1.0287538
LITESSGSPSKAEK,ph,S,212,true,"Col-0 X-ray callus - FC Col-0 vs. Col-0 Xray",111b,31410901,,66.2800000,,0.9168967,0.0000000,NO,,1.0287538
LITESSGSPSKAEK,ph,S,212,true,"atm callus - FC atm vs. atm Xray",111c,31410901,,66.2800000,,-1.3221200,0.0000000,NO,,1.0287538
LITESSGSPSKAEK,ph,S,212,true,"atm-3 X-ray callus - FC atm vs. atm Xray",111d,31410901,,66.2800000,,-1.3221200,0.0000000,NO,,1.0287538
LITESSGSPSK,ph,S,212,true,"Tissue atlas Arabidopsis - ProteomicsDB",114,32188942,"MaxQuant score",234.8200000,0.9667410,,,,0,
IEEDPEGSGTTHLFNCMK,so,C,311,true,"Arabidopsis S-sulfenylation chemoproteomics",108,31578252,"pFind PSM Score",0.1214450,,,,,,-1.3854045
CTYDHEAR,ox,C,454,true,"SPEAR - 10 mM H2O2 / mock",138a,34619326,,,,1.8071472,0.0120497,YES,,
CTYDHEAR,sno,C,454,true,"hot5-4 / wildtype, FAT-switch S-nitrosoproteome",169,37277371,,,,,,,,
CTYDHEARVEILR,ph,T,455,true,"SIRK1 phosphorylation",86a,23820729,"MaxQuant Score",115.8200000,1.0000000,,,,0.0489999987185,9.3270000
SSQVTDTSANKAEEK,ph,S,559,true,"Tissue atlas Arabidopsis - ProteomicsDB",114,32188942,"MaxQuant score",140.2200000,0.9914900,,,,7.3980999104606E-7,
SLQGTVLEIAIESISEAVETPGHNR,ph,T,989,true,"Tissue atlas Arabidopsis - ProteomicsDB",114,32188942,"MaxQuant score",66.4130000,0.9764370,,,,1.8603200260259E-6,
RPTRGSEDTVSDDKQSVSADDLLALTK,ph,T,997,true,"PAMP-triggered phosphorylation",48,24601666,"MASCOT Score",44.3000000,,,,,,
RPTRGSEDTVSDDK,ph,T,997,true,"Tissue atlas Arabidopsis - ProteomicsDB",114,32188942,"MaxQuant score",117.6500000,0.9178720,,,,2.5290499252151E-5,
GSEDTVSDDKQSVSADDLLALTK,ph,S,1000,true,"Tissue atlas Arabidopsis - ProteomicsDB",114,32188942,"MaxQuant score",178.7900000,0.8643940,,,,0,
GSEDTVSDDK,ph,S,1000,true,"atm and atr DNA damage response",88,25561503,"MASCOT Score",36.0000000,1.0000000,,,,,-0.8800000
GSEDTVSDDKQSVSADDLLALTK,ph,T,1003,true,"Tissue atlas Arabidopsis - ProteomicsDB",114,32188942,"MaxQuant score",154.2600000,0.8585050,,,,1.3103900672308E-38,
GSEDTVSDDKQSVSADDLLALTK,ph,S,1005,true,"srk2dei ABA signaling phopshoproteomics",83,23572148,"MASCOT Score",48.0000000,,,,,,0.0021000
GSEDTVSDDKQSVSADDLLALTK,ph,S,1005,true,"Phospho cell culture sucrose/TOR",109,30833711,,,0.9279190,,,,,
GSEDTVSDDKQSVSADDLLALTK,ph,S,1005,true,"Tissue atlas Arabidopsis - ProteomicsDB",114,32188942,"MaxQuant score",155.5500000,0.9934750,,,,6.6850204409233E-39,
GSEDTVSDDKQSVSADDLLALTK,ph,S,1010,true,"srk2dei ABA signaling phopshoproteomics",83,23572148,"MASCOT Score",48.0000000,,,,,,0.0021000
GSEDTVSDDKQSVSADDLLALTK,ph,S,1010,true,"SnRK2 protein kinase substrates",85,23776212,XCorr,3.1428435,0.8130000,,,,0.0017047900473699,
GSEDTVSDDKQSVSADDLLALTK,ph,S,1010,true,"TOR Kinase and ABA Receptor",100,29290610,XCorr,4.6160197,0.9948000,,,,5.1879999318771E-7,
GSEDTVSDDKQSVSADDLLALTK,ph,S,1010,true,"Phospho cell culture sucrose/TOR",109,30833711,,,0.9707320,,,,,
GSEDTVSDDKQSVSADDLLALTK,ph,S,1010,true,"Tissue atlas Arabidopsis - ProteomicsDB",114,32188942,"MaxQuant score",221.6900000,0.9999850,,,,0,
VNTACFAESAPLESTPPLPK,sno,C,1041,true,"hot5-4 / wildtype, FAT-switch S-nitrosoproteome",169,37277371,,,,,,,,
ATYSSFR,ph,S,1060,true,"Tissue atlas Arabidopsis - ProteomicsDB",114,32188942,"MaxQuant score",85.6700000,0.8385140,,,,8.6111096607056E-5,
ATYSSFR,ph,S,1061,true,"Tissue atlas Arabidopsis - ProteomicsDB",114,32188942,"MaxQuant score",126.0700000,0.9986330,,,,2.5288300093962E-5,
GSMDSPSRNYR,ph,S,1070,true,"Tissue atlas Arabidopsis - ProteomicsDB",114,32188942,"MaxQuant score",52.1010000,0.9531020,,,,0.0063776299357414,
NYRGSQSSGSPINAR,ph,S,1076,true,"Tissue atlas Arabidopsis - ProteomicsDB",114,32188942,"MaxQuant score",46.3580000,0.9388330,,,,0.0032131900079548,
GSQSSGSPINARPR,ph,S,1078,true,"atm and atr DNA damage response",88,25561503,"MASCOT Score",22.0000000,0.9770000,,,,,0.2100000
GSQSSGSPINARPR,ph,S,1078,true,"Tissue atlas Arabidopsis - ProteomicsDB",114,32188942,"MaxQuant score",93.7380000,0.8660510,,,,0.00014200899749994,
GSQSSGSPINARPR,ph,S,1081,true,"Tissue atlas Arabidopsis - ProteomicsDB",114,32188942,"MaxQuant score",144.5100000,0.9992100,,,,1.3917599517299E-6,
GSQSSGSPINAR,ph,S,1081,true,"atm and atr DNA damage response",88,25561503,"MASCOT Score",66.0000000,0.9470000,,,,,-0.4800000
