Peptide,PTM,ModifiedAA,ModifiedPosition,PeptideUniqueToGene,ExperimentDesc,ExpID,PubmedID,ScoreType,IdentScore,LocProb,Log2FChange,PQ-val,QuantSig,PEP,MassErrorPPM
EYEGEWESDEATTPTK,ph,S,171,true,"Tissue atlas Arabidopsis - ProteomicsDB",114,32188942,"MaxQuant score",287.8800000,0.9998040,,,,0,
LMSGLSISTVK,ph,S,191,true,"Phosphorylation in N starvation",63,22060019,"MASCOT Score",21.0000000,,,,,,1.6170400
LMSGLSISTVK,ph,S,191,true,"atm and atr DNA damage response",88,25561503,"MASCOT Score",58.0000000,1.0000000,,,,,0.5500000
LMSGLSISTVK,ph,S,191,true,"Tissue atlas Arabidopsis - ProteomicsDB",114,32188942,"MaxQuant score",141.5800000,1.0000000,,,,8.8403503184509E-8,
LMSGLSISTVK,ph,S,194,true,"Tissue atlas Arabidopsis - ProteomicsDB",114,32188942,"MaxQuant score",74.9870000,0.9483890,,,,0.00058365397853777,
CDYLSGDQPSSSSGDESGFKLSPGTPPIYNHR,ph,S,221,true,"Tissue atlas Arabidopsis - ProteomicsDB",114,32188942,"MaxQuant score",153.5600000,0.8974830,,,,0,
LSPGTPPIYNHR,ph,T,224,true,"atm and atr DNA damage response",88,25561503,"MASCOT Score",24.0000000,1.0000000,,,,,0.0300000
LSPGTPPIYNHR,ph,T,224,true,"Tissue atlas Arabidopsis - ProteomicsDB",114,32188942,"MaxQuant score",150.0600000,1.0000000,,,,1.6251000261036E-6,
