Peptide,PTM,ModifiedAA,ModifiedPosition,PeptideUniqueToGene,ExperimentDesc,ExpID,PubmedID,ScoreType,IdentScore,LocProb,Log2FChange,PQ-val,QuantSig,PEP,MassErrorPPM
DLVLSKVE,nt,D,26,true,"N-terminal ChaFRADIC",92,26010716,"MASCOT Score",26.7400000,,,,,0.0066829998977482,
FLGNNLAYLSVAPSEGKGKSK,ub,K,85,true,"Protein ubiquitination during photomorphogenesis",3,28461270,,,,,,,,
FLGNNLAYLSVAPSEGKGKSK,ub,K,87,true,"Protein ubiquitination during photomorphogenesis",3,28461270,,,,,,,,
TLVNLSVR,ng,N,94,true,"Conserved N-glycosylation",74,22633491,"MaxQuant Score",133.2700000,1.0000000,,,,0.0049999998882413,0.9830000
AHSIYYRDDIGNISTSEMK,ng,N,299,true,"N-Glycopeptide Profiling in Arabidopsis Infloresce",132,27067053,"MOWSE score",60.8000000,,,,,2.8000000540374E-8,
DDIGNISTSEMK,ng,N,299,true,"Conserved N-glycosylation",74,22633491,"MaxQuant Score",204.5900000,1.0000000,,,,0,0.1200000
DDIGNISTSEMK,ng,N,299,true,"N-Glycopeptide Profiling in Arabidopsis Infloresce",132,27067053,"MOWSE score",17.6000000,,,,,0.023000000044703,
FLNISFGSPILDLVTEK,ng,N,352,true,"Conserved N-glycosylation",74,22633491,"MaxQuant Score",93.5670000,1.0000000,,,,3.441999979259E-6,0.2190000
FLNISFGSPILDLVTEK,ng,N,352,true,"N-glycan occupancy Arabidopsis glycoproteins",87,23994444,"Ladder score",59.6000000,,,,,,
ADISISKSSPSYLAK,ph,Y,468,true,"BSK8 and BSL2 regulating sucrose-ph synthase",66,24924143,"MaxQuant Score",151.7000000,,,,,,-0.5640900
CLATHDK,sno,C,491,true,"hot5-4 / wildtype, FAT-switch S-nitrosoproteome",169,37277371,,,,-0.1151192,0.4153409,NO,,
TGDIQTCK,sno,C,514,true,"hot5-4 / wildtype, FAT-switch S-nitrosoproteome",169,37277371,,,,,,,,
KSTDSLLK,ph,S,520,true,"atm and atr DNA damage response",88,25561503,"MASCOT Score",32.0000000,0.9990000,,,,,-1.5100000
