Peptide,PTM,ModifiedAA,ModifiedPosition,PeptideUniqueToGene,ExperimentDesc,ExpID,PubmedID,ScoreType,IdentScore,LocProb,Log2FChange,PQ-val,QuantSig,PEP,MassErrorPPM
GRPSLLDLQK,ph,S,20,false,"atm and atr DNA damage response",88,25561503,"MASCOT Score",41.0000000,1.0000000,,,,,-1.3200000
PSLLDLQKR,ub,K,26,false,"Arabidopsis ubiquitination COFRADIC",40,26744219,"MaxQuant Score",63.0760000,1.0000000,,,,0.016000000759959,0.2400000
RNSNSEDDDDERR,ph,S,69,true,"atm and atr DNA damage response",88,25561503,"MASCOT Score",33.0000000,0.9420000,,,,,-0.3000000
LLHGLNSHEGR,ph,S,89,true,"Tissue atlas Arabidopsis - ProteomicsDB",114,32188942,"MaxQuant score",76.0100000,1.0000000,,,,0.00047316000564024,
KDFGNLRQESDGEEPVSLSQQPK,ph,S,248,true,"SnRK2 protein kinase substrates",85,23776212,XCorr,4.4767361,1.0000000,,,,0.012671500444412,
KDFGNLRQESDGEEPVSLSQQPK,ph,S,248,true,"Phospho cell culture sucrose/TOR",109,30833711,,,1.0000000,,,,,
DFGNLRQESDGEEPVSLSQQPK,ph,S,248,true,"srk2dei ABA signaling phopshoproteomics",83,23572148,"MASCOT Score",70.0000000,,,,,,-0.0010000
DFGNLRQESDGEEPVSLSQQPK,ph,S,248,true,"TOR Kinase and ABA Receptor",100,29290610,XCorr,3.9182472,1.0000000,,,,4.7000001359265E-5,
QESDGEEPVSLSQQPK,ph,S,248,true,"Tyrosine phosphorylation in Arabidopsis",59,18463617,"MASCOT Score",24.0000000,,,,,,-2.0688446
QESDGEEPVSLSQQPK,ph,S,248,true,"LAXIC - ABA stress",84a,23660473,XCorr,3.1500000,1.0000000,,,,6.6699998569675E-5,
QESDGEEPVSLSQQPK,ph,S,248,true,"SnRK2 protein kinase substrates",85,23776212,XCorr,3.6546073,1.0000000,,,,1.139199980571E-6,
QESDGEEPVSLSQQPK,ph,S,248,true,"atm and atr DNA damage response",88,25561503,"MASCOT Score",41.0000000,1.0000000,,,,,0.3800000
QESDGEEPVSLSQQPK,ph,S,248,true,"Col-0 callus - FC Col-0 vs. Col-0 Xray",111a,31410901,,56.8600000,,2.8700781,0.0276473,YES,,2.6412427
QESDGEEPVSLSQQPK,ph,S,248,true,"Col-0 X-ray callus - FC Col-0 vs. Col-0 Xray",111b,31410901,,56.8600000,,2.8700781,0.0276473,YES,,2.6412427
QESDGEEPVSLSQQPK,ph,S,248,true,"atm callus - FC atm vs. atm Xray",111c,31410901,,56.8600000,,1.2123585,0.1649355,NO,,2.6412427
QESDGEEPVSLSQQPK,ph,S,248,true,"atm-3 X-ray callus - FC atm vs. atm Xray",111d,31410901,,56.8600000,,1.2123585,0.1649355,NO,,2.6412427
QESDGEEPVSLSQQPK,ph,S,248,true,"Tissue atlas Arabidopsis - ProteomicsDB",114,32188942,"MaxQuant score",297.9400000,1.0000000,,,,0,
QKCSNDYASDDHHQSSR,ph,S,464,true,"Tissue atlas Arabidopsis - ProteomicsDB",114,32188942,"MaxQuant score",56.9590000,0.8732820,,,,0.00053201999980956,
IMSPSTSVSSSIIGNIHSSHESK,og,S,480,true,"O-GlcNac Inflorescence Tissue",81,28154133,"MASCOT Score",52.2000000,,,,,,1.3000000
IMSPSTSVSSSIIGNIHSSHESK,ph,S,480,true,"Tissue atlas Arabidopsis - ProteomicsDB",114,32188942,"MaxQuant score",112.3900000,0.9922240,,,,7.5213402282189E-17,
GSSGFNHKPNQMLETAGSQQGNIK,og,S,519,true,"O-GlcNac Inflorescence Tissue",81,28154133,"MASCOT Score",23.9000000,,,,,,1.2000000
LSSPNSPGSNHQAGSSQHPDLALQL,ph,S,560,true,"Phospho cell culture sucrose/TOR",109,30833711,,,0.8940250,,,,,
LSSPNSPGSNHQAGSSQHPDLALQL,ph,S,560,true,"Tissue atlas Arabidopsis - ProteomicsDB",114,32188942,"MaxQuant score",178.7400000,0.9992320,,,,0,
