Peptide,PTM,ModifiedAA,ModifiedPosition,PeptideUniqueToGene,ExperimentDesc,ExpID,PubmedID,ScoreType,IdentScore,LocProb,Log2FChange,PQ-val,QuantSig,PEP,MassErrorPPM
ITTFLSYSHSPPAK,ph,S,655,true,"Tissue atlas Arabidopsis - ProteomicsDB",114,32188942,"MaxQuant score",86.7270000,0.9863930,,,,7.6675198215526E-5,
SPGSSCSHSSSCSSETQVIK,fuc,S,660,true,"SPINDLY O-fucosylation",162,36739885,,,,,,,-0.56000000238419,
SPGSSCSHSSSCSSETQVIK,fuc,S,663,true,"SPINDLY O-fucosylation",162,36739885,,,,,,,-0.20000000298023,
SPGSSCSHSSSCSSETQVIKEDPTDK,fuc,S,666,true,"SPINDLY O-fucosylation",162,36739885,,,,,,,0.079999998211861,
SPGSSCSHSSSCSSETQVIK,fuc,S,666,true,"SPINDLY O-fucosylation",162,36739885,,,,,,,0.49000000953674,
SPGSSCSHSSSCSSETQVIKEDPTDK,fuc,S,668,true,"SPINDLY O-fucosylation",162,36739885,,,,,,,0.013000000268221,
SFKETQTTHLSPSSQEDDFLR,ph,S,692,true,"Tissue atlas Arabidopsis - ProteomicsDB",114,32188942,"MaxQuant score",196.3000000,0.9999690,,,,0,
ETQTTHLSPSSQEDDFLR,ph,S,702,true,"Tissue atlas Arabidopsis - ProteomicsDB",114,32188942,"MaxQuant score",136.9200000,0.9999850,,,,2.604629912697E-15,
ETQTTHLSPSSQEDDFLR,ph,S,704,true,"Tissue atlas Arabidopsis - ProteomicsDB",114,32188942,"MaxQuant score",112.8200000,0.9599500,,,,1.0077699785782E-9,
