Peptide,PTM,ModifiedAA,ModifiedPosition,PeptideUniqueToGene,ExperimentDesc,ExpID,PubmedID,ScoreType,IdentScore,LocProb,Log2FChange,PQ-val,QuantSig,PEP,MassErrorPPM
FFEWNITYGDIYPLGVR,ng,N,33,true,"N-glycan occupancy Arabidopsis glycoproteins",87,23994444,"Ladder score",67.7000000,,,,,,
NSFVDGVYGTTCPIPPGK,sno,C,103,true,"hot5-4 / wildtype, FAT-switch S-nitrosoproteome",169,37277371,,,,0.0763085,0.7327394,NO,,
NYTYILQMK,ng,N,110,true,"Conserved N-glycosylation",74,22633491,"MaxQuant Score",150.7100000,1.0000000,,,,3.0720000185695E-33,-0.1870000
NYTYILQMK,ng,N,110,true,"N-glycan occupancy Arabidopsis glycoproteins",87,23994444,"Ladder score",56.9000000,,,,,,
IPVPFPDPAGDTTVLIGDWYKANHTDLR,ng,N,172,true,"Conserved N-glycosylation",74,22633491,"MaxQuant Score",219.5000000,1.0000000,,,,0,2.5250000
IPVPFPDPAGDTTVLIGDWYKANHTDLR,ng,N,172,true,"N-glycan occupancy Arabidopsis glycoproteins",87,23994444,"Ladder score",62.4000000,,,,,,
SSGATLNVEQGKTYR,ac,K,209,true,"Quantitative Acetylproteomics",101,29440448,,,,,,,,
VTADQTPR,nt,V,263,true,"Arg/N-end rule seed, prt6 vs. Wt",99,29168982,"MASCOT Score",40.3700000,,-0.4319472,0.1602149,NO,0.1782999932766,-0.3942543
TNLSASGPRPNPQGSYHYGMINTTR,ng,N,325,true,"Conserved N-glycosylation",74,22633491,"MaxQuant Score",269.0600000,1.0000000,,,,0,-0.3120000
TNLSASGPRPNPQGSYHYGMINTTR,ng,N,345,true,"Conserved N-glycosylation",74,22633491,"MaxQuant Score",269.0600000,1.0000000,,,,0,-0.3120000
LASSAGQVDGKQR,ac,K,362,true,"Quantitative Acetylproteomics",101,29440448,,,,,,,,
QYLGQQLYLR,nt,Q,500,false,"HUNTER N-terminome: legumain, GluC and trypsin",119,31951383,"MaxQuant score",152.6300000,,,,,,
NALLCGR,ox,C,530,false,"OxiTRAQ Arabidopsis - 5 mM H2O2 versus control",47,24376095,,,,-0.3136070,0.0687737,NO,,
NALLCGR,ox,C,530,false,"OxiTRAQ SA and flg22 responses - SA vs mock",91a,25720653,"MASCOT Score",40.0500000,,0.6780719,0.0030000,YES,,
NALLCGR,ox,C,530,false,"OxiTRAQ SA and flg22 responses - flg22 vs mock",91b,25720653,"MASCOT Score",40.0500000,,-0.5353317,0.0020000,NO,,
NALLCGR,sno,C,530,false,"hot5-4 / wildtype, FAT-switch S-nitrosoproteome",169,37277371,,,,-0.5873839,0.0056159,YES,,
