Peptide,PTM,ModifiedAA,ModifiedPosition,PeptideUniqueToGene,ExperimentDesc,ExpID,PubmedID,ScoreType,IdentScore,LocProb,Log2FChange,PQ-val,QuantSig,PEP,MassErrorPPM
MEVLLGSDDGSLAFVPSEFTVAKGE,nt,M,73,true,"N-terminal ChaFRADIC",92,26010716,"MASCOT Score",80.6500000,,,,,7.7470002635138E-11,
MEVLLGSDDGSLAFVPSE,nt,M,73,true,"N-terminal ChaFRADIC",92,26010716,"MASCOT Score",102.4300000,,,,,8.8169999079568E-10,
MEVLLGSDDGSLAFVPSE,nt,M,73,true,"HUNTER N-terminome: legumain, GluC and trypsin",119,31951383,"MaxQuant score",122.5100000,,,,,,
MEVLLGSDD,nt,M,73,true,"HUNTER N-terminome: legumain, GluC and trypsin",119,31951383,"MaxQuant score",85.2120000,,,,,,
SDDGSLAFVPSE,nt,S,79,true,"Arg/N-end rule seed, prt6 vs. Wt",99,29168982,"MASCOT Score",33.8900000,,0.3513865,0.5679969,NO,0.040830001235008,3.0117754
GEKIVFK,ac,K,98,false,"Histone deacetylases substrates - hda14 vs WT",98e,29061669,"MaxQuant Score",103.7000000,1.0000000,0.0250000,0.9772372,NO,0.0010000000474975,
GEKIVFK,ac,K,98,false,"Quantitative Acetylproteomics",101,29440448,,,,,,,,
TALLNGAGETYE,nt,T,132,true,"N-terminal ChaFRADIC",92,26010716,"MASCOT Score",44.8000000,,,,,3.6000001273351E-5,
