Peptide,PTM,ModifiedAA,ModifiedPosition,PeptideUniqueToGene,ExperimentDesc,ExpID,PubmedID,ScoreType,IdentScore,LocProb,Log2FChange,PQ-val,QuantSig,PEP,MassErrorPPM
AMSFGHR,ph,S,27,true,"Phospho cell culture sucrose/TOR",109,30833711,,,1.0000000,,,,,
AMSFGHR,ph,S,27,true,"Tissue atlas Arabidopsis - ProteomicsDB",114,32188942,"MaxQuant score",106.6000000,1.0000000,,,,0.016844499856234,
VPPFSPGR,ph,S,36,true,"Phosphorylation Early Elicitor Signaling",23,17317660,,,,,,,,
VPPFSPGR,ph,S,36,true,"atm and atr DNA damage response",88,25561503,"MASCOT Score",30.0000000,1.0000000,,,,,0.2800000
VPPFSPGR,ph,S,36,true,"Tissue atlas Arabidopsis - ProteomicsDB",114,32188942,"MaxQuant score",145.9000000,1.0000000,,,,0.001977930078283,
MFFSGPMVPLVPNAAR,ph,S,58,true,"Large-scale phosphorylation discovery",44,23111157,XCorr,3.7270000,,,,,,
MFFSGPMVPLVPNAAR,ph,S,58,true,"TOR Kinase and ABA Receptor",100,29290610,XCorr,3.8875585,1.0000000,,,,1.1819999599538E-5,
NKSDAVWDEPTSPK,ph,S,76,true,"Tissue atlas Arabidopsis - ProteomicsDB",114,32188942,"MaxQuant score",240.8200000,1.0000000,,,,0,
NKSDAVWDEPTSPK,ph,T,84,true,"Tissue atlas Arabidopsis - ProteomicsDB",114,32188942,"MaxQuant score",154.2800000,0.9022050,,,,3.4303100360233E-9,
SDAVWDEPTSPK,ph,T,84,true,"TOR Kinase and ABA Receptor",100,29290610,XCorr,3.5427749,0.9279000,,,,0.00057680002646521,
NKSDAVWDEPTSPK,ph,S,85,true,"Tissue atlas Arabidopsis - ProteomicsDB",114,32188942,"MaxQuant score",260.0700000,0.9758990,,,,0,
SDAVWDEPTSPK,ph,S,85,true,"Large-scale phosphorylation discovery",44,23111157,XCorr,4.1280000,,,,,,
SDAVWDEPTSPK,ph,S,85,true,"srk2dei ABA signaling phopshoproteomics",83,23572148,"MASCOT Score",25.0000000,,,,,,0.0008000
SDAVWDEPTSPK,ph,S,85,true,"atm and atr DNA damage response",88,25561503,"MASCOT Score",36.0000000,0.9590000,,,,,0.0700000
SDAVWDEPTSPK,ph,S,85,true,"Phospho cell culture sucrose/TOR",109,30833711,,,0.8662410,,,,,
IKSIFSFSPASGR,ph,S,139,true,"Tissue atlas Arabidopsis - ProteomicsDB",114,32188942,"MaxQuant score",131.6100000,0.9999920,,,,4.2538900743239E-5,
SIFSFSPASGR,ph,S,142,true,"MAPK Arabidopsis substrates",45,23172892,"MaxQuant Score",116.5400000,,,,,,
SIFSFSPASGR,ph,S,142,true,"Chloroplast kinase substrates",60,19376835,"MASCOT Score",49.8400000,,,,,,-0.0763270
SIFSFSPASGR,ph,S,142,true,"atm and atr DNA damage response",88,25561503,"MASCOT Score",45.0000000,0.9970000,,,,,0.0100000
SIFSFSPASGR,ph,S,142,true,"TOR Kinase and ABA Receptor",100,29290610,XCorr,3.9465289,0.9915000,,,,2.4069999199128E-5,
SIFSFSPASGR,ph,S,142,true,"Tissue atlas Arabidopsis - ProteomicsDB",114,32188942,"MaxQuant score",138.4200000,0.9999370,,,,1.3106799769957E-6,
SIFSFSPASGR,ph,S,144,true,"atm and atr DNA damage response",88,25561503,"MASCOT Score",48.0000000,0.9960000,,,,,0.1800000
SIFSFSPASGR,ph,S,144,true,"Tissue atlas Arabidopsis - ProteomicsDB",114,32188942,"MaxQuant score",146.3600000,0.9950080,,,,3.4424399331101E-8,
SIFSFSPASGR,ph,S,147,true,"Tissue atlas Arabidopsis - ProteomicsDB",114,32188942,"MaxQuant score",118.6100000,0.9340890,,,,2.6519699531491E-5,
HEEESPADHHR,ph,S,207,true,"atm and atr DNA damage response",88,25561503,"MASCOT Score",54.0000000,1.0000000,,,,,-0.9200000
GYYSDDDTRGAYLR,ph,S,217,true,"srk2dei ABA signaling phopshoproteomics",83,23572148,"MASCOT Score",35.0000000,,,,,,0.0013000
GYYSDDDTR,ph,S,217,true,"TOR Kinase and ABA Receptor",100,29290610,XCorr,2.7642863,0.9999000,,,,0.0018840000266209,
GYYSDDDTR,ph,S,217,true,"Col-0 callus - FC Col-0 vs. Col-0 Xray",111a,31410901,,31.7000000,,-1.3263091,0.0000000,NO,,-0.2526809
GYYSDDDTR,ph,S,217,true,"Col-0 X-ray callus - FC Col-0 vs. Col-0 Xray",111b,31410901,,31.7000000,,-1.3263091,0.0000000,NO,,-0.2526809
GYYSDDDTR,ph,S,217,true,"atm callus - FC atm vs. atm Xray",111c,31410901,,31.7000000,,-1.6624710,0.0000000,NO,,-0.2526809
GYYSDDDTR,ph,S,217,true,"atm-3 X-ray callus - FC atm vs. atm Xray",111d,31410901,,31.7000000,,-1.6624710,0.0000000,NO,,-0.2526809
GYYSDDDTR,ph,S,217,true,"Tissue atlas Arabidopsis - ProteomicsDB",114,32188942,"MaxQuant score",146.7100000,1.0000000,,,,9.1324502136558E-5,
YDDDEDEDDIIIPFSAPLGLKPK,ph,S,242,true,"SnRK2 protein kinase substrates",85,23776212,XCorr,2.9681647,1.0000000,,,,6.6680996724244E-8,
YDDDEDEDDIIIPFSAPLGLKPK,ph,S,242,true,"Phospho cell culture sucrose/TOR",109,30833711,,,0.9987830,,,,,
TMDPPKPLHLQTI,ph,T,271,true,"Tissue atlas Arabidopsis - ProteomicsDB",114,32188942,"MaxQuant score",93.7680000,1.0000000,,,,0.00020966099691577,
