Peptide,PTM,ModifiedAA,ModifiedPosition,PeptideUniqueToGene,ExperimentDesc,ExpID,PubmedID,ScoreType,IdentScore,LocProb,Log2FChange,PQ-val,QuantSig,PEP,MassErrorPPM
DIVGSAYYVAPEVLHR,ph,S,38,false,"Tissue atlas Arabidopsis - ProteomicsDB",114,32188942,"MaxQuant score",153.2400000,1.0000000,,,,7.4156701612704E-11,
VIAENLSEEEIK,ph,S,172,true,"Tissue atlas Arabidopsis - ProteomicsDB",114,32188942,"MaxQuant score",127.0200000,1.0000000,,,,3.698340151459E-5,
NMDTDESGTITFDELR,ph,S,191,true,"Tissue atlas Arabidopsis - ProteomicsDB",114,32188942,"MaxQuant score",180.3200000,0.9727410,,,,6.0496098077227E-27,
LGSKLTESEIK,ph,S,208,true,"atm and atr DNA damage response",88,25561503,"MASCOT Score",46.0000000,0.9320000,,,,,-1.5300000
LGSKLTESEIK,ph,S,208,true,"Protein sumoylation and phosphorylation cross-talk",97,28419593,,,,,,,,
LGSKLTESEIK,ph,S,208,true,"Phosphorylation tonoplast membrane fraction",107,18686298,"MASCOT Score",39.0000000,,,,,,
LGSKLTESEIK,ph,S,208,true,"Tissue atlas Arabidopsis - ProteomicsDB",114,32188942,"MaxQuant score",237.5900000,1.0000000,,,,0,
KGTTDSDPK,ph,S,317,true,"atm and atr DNA damage response",88,25561503,"MASCOT Score",23.0000000,1.0000000,,,,,-2.3700000
