Peptide,PTM,ModifiedAA,ModifiedPosition,PeptideUniqueToGene,ExperimentDesc,ExpID,PubmedID,ScoreType,IdentScore,LocProb,Log2FChange,PQ-val,QuantSig,PEP,MassErrorPPM
GTNDLDIEEGTLEIGMEYR,nt,G,2,true,"Arg/N-end rule pathway Roots",80,25728785,"MASCOT Score",84.6200000,,,,,1.7909999872057E-11,
GTNDLDIEEGTLEIGMEYR,nt,G,2,true,"N-terminal ChaFRADIC",92,26010716,"MASCOT Score",95.6400000,,,,,2.6649999915196E-11,
GTNDLDIEEGTLEIGMEYR,nt,G,2,true,"Arg/N-end rule seed, prt6 vs. Wt",99,29168982,"MASCOT Score",90.2700000,,-0.1383023,0.2683275,NO,2.9220000214991E-6,-1.6524231
GTNDLDIEEGTLEIGMEYR,nt,G,2,true,"FtsH12 N-terminome: WT / FtsH12 knockdown miRNA",118,33216923,"MaxQuant score",95.2270000,,-0.1674235,0.2954212,NO,3.1299998535942E-14,
GTNDLDIEEGTLEIGMEYR,nt,G,2,true,"HUNTER N-terminome: legumain, GluC and trypsin",119,31951383,"MaxQuant score",169.4000000,,,,,,
GTNDLDIEEGTLEIGMEYR,nt,G,2,true,"Arabidopsis translation initiation landscape - NT",167b,35069635,,,,,,,,
GTNDLDIEEGTLE,nt,G,2,true,"N-terminal ChaFRADIC",92,26010716,"MASCOT Score",65.7400000,,,,,0.0001538999931654,
GTNDLDIEEGTL,nt,G,2,true,"N-terminal ChaFRADIC",92,26010716,"MASCOT Score",56.9800000,,,,,5.9809998731453E-8,
GTNDLDIEEG,nt,G,2,true,"N-term acetylation drought responses",5,26184543,,,,,,,,
GTNDLDIEE,nt,G,2,true,"N-terminal ChaFRADIC",92,26010716,"MASCOT Score",80.8100000,,,,,0.00953199993819,
GTNDLDIEE,nt,G,2,true,"Arg/N-end rule seed, prt6 vs. Wt",99,29168982,"MASCOT Score",39.2200000,,-0.1013763,0.5467087,NO,0.0041589997708797,-1.7376593
GTNDLDIE,nt,G,2,true,"N-terminal ChaFRADIC",92,26010716,"MASCOT Score",75.7000000,,,,,0.078939996659756,
GTNDLDIE,nt,G,2,true,"Arg/N-end rule seed, prt6 vs. Wt",99,29168982,"MASCOT Score",37.0000000,,-0.2855807,0.0019678,NO,0.043549999594688,-0.0657174
GTNDLDIEEGTLEIGMEYR,nta,G,2,true,"N-terminal ChaFRADIC",92,26010716,"MASCOT Score",63.9000000,,,,,7.3559999691497E-7,
GTNDLDIEEGTLEIGMEYR,nta,G,2,true,"HUNTER N-terminome: legumain, GluC and trypsin",119,31951383,"MaxQuant score",134.2100000,,,,,,
GTNDLDIEE,nta,G,2,true,"HUNTER N-terminome: legumain, GluC and trypsin",119,31951383,"MaxQuant score",168.2700000,,,,,,
TNDLDIEEGTLEIGMEYR,nt,T,3,true,"N-terminal ChaFRADIC",92,26010716,"MASCOT Score",36.4700000,,,,,7.3160002500572E-8,
TNDLDIEEGTLEIGMEYR,nt,T,3,true,"Arg/N-end rule seed, prt6 vs. Wt",99,29168982,"MASCOT Score",39.3000000,,-0.1884074,0.8013378,NO,0.036529999226332,-4.8202039
TNDLDIEEGTLEIGMEYR,nt,T,3,true,"HUNTER N-terminome: legumain, GluC and trypsin",119,31951383,"MaxQuant score",91.2070000,,,,,,
TNDLDIEEGTLE,nt,T,3,true,"N-terminal ChaFRADIC",92,26010716,"MASCOT Score",58.0700000,,,,,6.0859998484375E-5,
TNDLDIEE,nt,T,3,true,"N-terminal ChaFRADIC",92,26010716,"MASCOT Score",62.1700000,,,,,0.039329998195171,
TNDLDIEE,nt,T,3,true,"Arg/N-end rule seed, prt6 vs. Wt",99,29168982,"MASCOT Score",47.5500000,,0.3360712,0.3498208,NO,0.0070210001431406,-1.3156965
GTNDLDIEEGTLEIGMEYR,ph,T,3,true,"Tissue atlas Arabidopsis - ProteomicsDB",114,32188942,"MaxQuant score",89.6680000,1.0000000,,,,1.4013299733051E-5,
GPKYQEIVNIR,ub,K,39,false,"upl3 mutant / wildtype",168,35926874,"MaxQuant score",99.2830000,1.0000000,0.2509616,0.6560200,NO,0.00013645300350618,0.5271300
RGQVLEVDGEKAVVQVFEGTSGIDNK,ub,K,65,false,"upl3 mutant / wildtype",168,35926874,"MaxQuant score",100.2300000,1.0000000,,,,1.34797997417E-11,-1.1014000
AVVQVFEGTSGIDNK,ph,S,75,false,"Tissue atlas Arabidopsis - ProteomicsDB",114,32188942,"MaxQuant score",210.6300000,0.9635310,,,,1.4012984643248E-45,
ISGSSINPSE,nt,I,125,false,"Arg/N-end rule seed, prt6 vs. Wt",99,29168982,"MASCOT Score",46.1300000,,-1.1318123,0.1016491,NO,0.006012000143528,-1.3314353
GQKIPLFSAAGLPHNEIAAQICR,ub,K,160,false,"upl3 mutant / wildtype",168,35926874,"MaxQuant score",88.7680000,1.0000000,0.8734195,,,2.2116699582853E-8,-0.7441300
SAAGLPHNEIAAQICRQAGL,nt,S,165,false,"Arabidopsis translation initiation landscape - NT",167b,35069635,,,,,,,,
SAAGLPHNEIAAQICR,nt,S,165,false,"Arg/N-end rule seed, prt6 vs. Wt",99,29168982,"MASCOT Score",44.5700000,,,,,0.022879999130964,-2.9155371
SAAGLPHNE,nt,S,165,false,"Arg/N-end rule seed, prt6 vs. Wt",99,29168982,"MASCOT Score",33.3300000,,0.4301822,0.3014799,NO,0.015769999474287,0.1957327
EIAAQICR,nt,E,173,false,"Arg/N-end rule seed, prt6 vs. Wt",99,29168982,"MASCOT Score",33.1200000,,,,,0.15539999306202,-0.4556975
GQKIPLFSAAGLPHNEIAAQICR,ox,C,179,false,"OxiTRAQ SA and flg22 responses - SA vs mock",91a,25720653,"MASCOT Score",49.1200000,,0.8237494,0.0510000,NO,,
GQKIPLFSAAGLPHNEIAAQICR,ox,C,179,false,"OxiTRAQ SA and flg22 responses - flg22 vs mock",91b,25720653,"MASCOT Score",49.1200000,,0.8639385,0.0390000,YES,,
IPLFSAAGLPHNEIAAQICR,ox,C,179,false,"OxiTRAQ SA and flg22 responses - SA vs mock",91a,25720653,"MASCOT Score",54.4800000,,0.7655347,0.0220000,YES,,
IPLFSAAGLPHNEIAAQICR,ox,C,179,false,"OxiTRAQ SA and flg22 responses - flg22 vs mock",91b,25720653,"MASCOT Score",54.4800000,,0.6870607,0.0810000,NO,,
IPLFSAAGLPHNEIAAQICR,ox,C,179,false,"SPEAR - 10 mM H2O2 / mock",138a,34619326,,,,2.6019903,0.0145151,YES,,
IPLFSAAGLPHNEIAAQICR,sno,C,179,false,"Site-specific nitrosomeproteomic id - gsnor1-3",90b,25699590,XCorr,2.8100000,,,,,5.5659998906776E-5,-5.6800000
QAGLVKR,ac,K,186,false,"Quantitative Acetylproteomics",101,29440448,,,,,,,,
LNLANDPTIE,nt,L,237,false,"Arg/N-end rule seed, prt6 vs. Wt",99,29168982,"MASCOT Score",50.9000000,,-0.3221136,0.2217003,NO,0.000430599990068,-1.5343655
NLANDPTIE,nt,N,238,false,"Arg/N-end rule seed, prt6 vs. Wt",99,29168982,"MASCOT Score",40.8700000,,-0.1320036,0.5259910,NO,0.018230000510812,-1.2049960
IALTTAEYLAYECGK,acy,C,265,false,"Arabidopsis S-acylation atlas - Meristem",163a,35681017,,,,,,,,
IALTTAEYLAYECGK,so,C,265,false,"S-sulfenylation site detection using YAP1C",110,32714340,,,,,,,,
DMSSYADALR,nt,D,275,false,"Arg/N-end rule seed, prt6 vs. Wt",99,29168982,"MASCOT Score",60.7800000,,,,,0.0044530001468956,-1.6703247
DMSSYADALR,nta,D,275,false,"FtsH12 N-terminome: WT / FtsH12 knockdown miRNA",118,33216923,"MaxQuant score",90.6140000,,-0.1939780,0.1314559,NO,0,
QIYPPINVLPSLSR,nt,Q,363,false,"HUNTER N-terminome: legumain, GluC and trypsin",119,31951383,"MaxQuant score",113.7700000,,,,,,
LMKSAIGEGMTR,ac,K,379,false,"Quantitative Acetylproteomics",101,29440448,,,,,,,,
SAIGEGMTRK,nt,S,380,false,"Arabidopsis translation initiation landscape - NT",167b,35069635,,,,,,,,
SAIGEGMTRK,mox,M,386,false,"cat2 Methionine oxidation - 1h stress",62a,25693801,"MASCOT Score",66.0000000,,0.0320804,,NO,,
SAIGEGMTRK,mox,M,386,false,"cat2 Methionine oxidation - 3h stress",62b,25693801,"MASCOT Score",65.0000000,,-0.2769697,,NO,,
DVQAMK,mox,M,411,false,"cat2 Methionine oxidation - 3h stress",62b,25693801,"MASCOT Score",36.0000000,,0.0490364,,NO,,
KFVMQGAYDTR,ub,K,437,false,"upl3 mutant / wildtype",168,35926874,"MaxQuant score",98.1050000,1.0000000,-0.1992554,0.7714200,NO,0.00026190100470558,-0.0494300
IPAKTLDQFYSR,ub,K,474,false,"Ubiquitination Membrane Proteins",120,33585938,,,,,,,,
IPAKTLDQFYSR,ub,K,474,false,"upl3 mutant / wildtype",168,35926874,"MaxQuant score",95.3460000,1.0000000,1.2351143,0.1445420,NO,7.5180199928582E-5,1.6655000
TLDQFYSRDSTS,ph,S,486,false,"TOR Kinase and ABA Receptor",100,29290610,XCorr,3.0403073,0.9144000,,,,0.094360001385212,
TLDQFYSRDSTS,ph,S,486,false,"Tissue atlas Arabidopsis - ProteomicsDB",114,32188942,"MaxQuant score",221.8600000,0.7698680,,,,3.8510106045989E-39,
