Peptide,PTM,ModifiedAA,ModifiedPosition,PeptideUniqueToGene,ExperimentDesc,ExpID,PubmedID,ScoreType,IdentScore,LocProb,Log2FChange,PQ-val,QuantSig,PEP,MassErrorPPM
SAKKIVLKSSDGESFE,nta,S,2,true,"Arabidopsis translation initiation landscape - NTA",167a,35069635,,,,,,,,
SQTIAHMVE,nt,S,26,false,"Arabidopsis translation initiation landscape - NT",167b,35069635,,,,,,,,
SSDGESFEVEEAVALESQTIAHMVEDDCVDNGVPLPNVTSK,so,C,37,true,"S-sulfenylation site detection using YAP1C",110,32714340,,,,,,,,
ILAKVIEYCK,ub,K,54,false,"upl3 mutant / wildtype",168,35926874,"MaxQuant score",82.2610000,1.0000000,1.1375035,0.2419800,NO,0.0014682000037283,-0.6071100
VIEYCK,sno,C,59,false,"hot5-4 / wildtype, FAT-switch S-nitrosoproteome",169,37277371,,,,,,,,
VIEYCKR,so,C,59,false,"S-sulfenylation site detection using YAP1C",110,32714340,,,,,,,,
VIEYCK,so,C,59,false,"Arabidopsis S-sulfenylation chemoproteomics",108,31578252,"pFind PSM Score",0.2962380,,,,,,0.7726998
VIEYCKR,ub,K,60,false,"upl3 mutant / wildtype",168,35926874,"MaxQuant score",55.4410000,1.0000000,-0.9268653,,,0.028507800772786,0.2764600
HVEAAASKAEAVEGAATSDDDLK,ub,K,69,true,"upl3 mutant / wildtype",168,35926874,"MaxQuant score",151.4200000,1.0000000,-0.2532573,0.7572000,NO,3.072209920698E-25,-0.4924900
AEAVEGAATSDDDLK,ph,T,78,true,"TOR Kinase and ABA Receptor",100,29290610,XCorr,4.4939852,0.9945000,,,,7.7790002706024E-7,
AEAVEGAATSDDDLK,ph,T,78,true,"Tissue atlas Arabidopsis - ProteomicsDB",114,32188942,"MaxQuant score",114.6800000,0.8595110,,,,7.6811098326613E-17,
AEAVEGAATSDDDLKAWDADFMK,ph,S,79,true,"SnRK2 protein kinase substrates",85,23776212,XCorr,3.5954392,0.8380000,,,,0.0013559400103986,
AEAVEGAATSDDDLKAWDADFMK,ph,S,79,true,"Phospho cell culture sucrose/TOR",109,30833711,,,0.7952780,,,,,
AEAVEGAATSDDDLKAWDADFMK,ph,S,79,true,"Tissue atlas Arabidopsis - ProteomicsDB",114,32188942,"MaxQuant score",169.1300000,0.9900420,,,,1.4012984643248E-45,
AEAVEGAATSDDDLK,ph,S,79,true,"Tyrosine phosphorylation in Arabidopsis",59,18463617,"MASCOT Score",62.0000000,,,,,,-1.0186942
AEAVEGAATSDDDLK,ph,S,79,true,"srk2dei ABA signaling phopshoproteomics",83,23572148,"MASCOT Score",82.0000000,,,,,,0.0000000
NLLDLTCQTVADMIK,so,C,118,true,"S-sulfenylation site detection using YAP1C",110,32714340,,,,,,,,
NLLDLTCQTVADMIKGK,ub,K,126,true,"upl3 mutant / wildtype",168,35926874,"MaxQuant score",136.3400000,1.0000000,0.2497487,,,1.4396699977992E-12,-1.0688000
GKTPEEIR,ub,K,128,false,"upl3 mutant / wildtype",168,35926874,"MaxQuant score",80.1650000,1.0000000,0.2128806,0.6132600,NO,0.027749199420214,0.8996800
TTFNIKNDFTPEEEEEVRR,ac,K,140,true,"Quantitative Acetylproteomics",101,29440448,,,,,,,,
TTFNIKNDFTPEEEEEVRR,ub,K,140,true,"upl3 mutant / wildtype",168,35926874,"MaxQuant score",171.9800000,1.0000000,0.3606452,0.7266000,NO,9.096220128933E-26,0.0286350
TFNIKNDFTPEEEEEVRR,ub,K,140,false,"upl3 mutant / wildtype",168,35926874,"MaxQuant score",95.2050000,1.0000000,-0.6574453,,,2.9834899351044E-7,1.4309000
NDFTPEEEEEVRR,ph,T,144,false,"srk2dei ABA signaling phopshoproteomics",83,23572148,"MASCOT Score",28.0000000,,,,,,-0.0003000
NDFTPEEEEEVRR,ph,T,144,false,"atm and atr DNA damage response",88,25561503,"MASCOT Score",61.0000000,1.0000000,,,,,0.4100000
NDFTPEEEEEVRR,ph,T,144,false,"TOR Kinase and ABA Receptor",100,29290610,XCorr,2.5875196,1.0000000,,,,0.01482000015676,
NDFTPEEEEEVRR,ph,T,144,false,"Col-0 callus - FC Col-0 vs. Col-0 Xray",111a,31410901,,33.5100000,,1.7480261,0.0139285,YES,,0.6619140
NDFTPEEEEEVRR,ph,T,144,false,"Col-0 X-ray callus - FC Col-0 vs. Col-0 Xray",111b,31410901,,33.5100000,,1.7480261,0.0139285,YES,,0.6619140
NDFTPEEEEEVRR,ph,T,144,false,"atm callus - FC atm vs. atm Xray",111c,31410901,,33.5100000,,1.0633467,0.1164971,NO,,0.6619140
NDFTPEEEEEVRR,ph,T,144,false,"atm-3 X-ray callus - FC atm vs. atm Xray",111d,31410901,,33.5100000,,1.0633467,0.1164971,NO,,0.6619140
NDFTPEEEEEVRR,ph,T,144,false,"Tissue atlas Arabidopsis - ProteomicsDB",114,32188942,"MaxQuant score",185.6700000,1.0000000,,,,1.0080500098134E-22,
