Peptide,PTM,ModifiedAA,ModifiedPosition,PeptideUniqueToGene,ExperimentDesc,ExpID,PubmedID,ScoreType,IdentScore,LocProb,Log2FChange,PQ-val,QuantSig,PEP,MassErrorPPM
QLFNFADTKR,ac,K,243,true,"Quantitative Acetylproteomics",101,29440448,,,,,,,,
AVMCGLLPK,acy,C,344,true,"Arabidopsis S-acylation atlas - Hypocotyl",163b,35681017,,,,,,,,
AVMCGLLPK,acy,C,344,true,"Arabidopsis S-acylation atlas - Leaf",163c,35681017,,,,,,,,
AVMCGLLPK,acy,C,344,true,"Arabidopsis S-acylation atlas - Silique",163e,35681017,,,,,,,,
AVMCGLLPK,acy,C,344,true,"Arabidopsis S-acylation atlas - Stem",163f,35681017,,,,,,,,
AVMCGLLPK,ox,C,344,true,"OxiTRAQ Arabidopsis - 5 mM H2O2 versus control",47,24376095,,,,-0.0130505,0.5635339,NO,,
ISCDGK,ox,C,398,true,"OxiTRAQ Arabidopsis - 5 mM H2O2 versus control",47,24376095,,,,-0.0600069,0.5165151,NO,,
GASIPADATTGCLDGFK,acy,C,456,true,"Arabidopsis S-acylation atlas - Hypocotyl",163b,35681017,,,,,,,,
GASIPADATTGCLDGFK,acy,C,456,true,"Arabidopsis S-acylation atlas - Silique",163e,35681017,,,,,,,,
GASIPADATTGCLDGFK,acy,C,456,true,"Arabidopsis S-acylation atlas - Stem",163f,35681017,,,,,,,,
GASIPADATTGCLDGFK,sno,C,456,true,"hot5-4 / wildtype, FAT-switch S-nitrosoproteome",169,37277371,,,,-0.5465621,0.2417011,NO,,
