Peptide,PTM,ModifiedAA,ModifiedPosition,PeptideUniqueToGene,ExperimentDesc,ExpID,PubmedID,ScoreType,IdentScore,LocProb,Log2FChange,PQ-val,QuantSig,PEP,MassErrorPPM
KSAPTTGGVKKPHR,ac,K,28,false,"Histone deacetylases - apicidin vs control",98a,29061669,"MaxQuant Score",149.4000000,1.0000000,1.7510000,0.0004406,YES,7.1000002322195E-17,
KSAPTTGGVKKPHR,ac,K,28,false,"Histone deacetylases- hda14 vs WT (low light)",98c,29061669,"MaxQuant Score",171.2600000,1.0000000,-1.0460000,0.9885531,NO,8.1999997070259E-12,
KSAPTTGGVKKPHR,ac,K,28,false,"Histone deacetylases substrates - hda14 vs WT",98e,29061669,"MaxQuant Score",150.8000000,1.0000000,-0.1310000,0.8709636,NO,3.3631163143796E-44,
KSAPTTGGVKKPHR,ac,K,28,false,"Quantitative Acetylproteomics",101,29440448,,,,,,,,
KSAPTTGGVK,hib,K,28,false,"Histone Khib and acetylation, dark-induced starvat",137,34165567,,,1.0000000,,,,,
KSAPTTGGVKKPHR,me1,K,28,false,"Arabidopsis protein methylome",123,31809900,"MaxQuant Score",44.9250000,1.0000000,,,,0.0088568199425936,-0.7000900
KSAPTTGGVKK,me2,K,28,false,"Arabidopsis protein methylome",123,31809900,"MaxQuant Score",105.0300000,1.0000000,,,,4.9011898227036E-5,-0.6724000
KSAPTTGGVK,me3,K,28,false,"Arabidopsis protein methylome",123,31809900,"MaxQuant Score",72.2900000,1.0000000,,,,0.0041200402192771,-0.2235400
KSAPTTGGVKKPHR,ac,K,37,false,"Histone deacetylases - apicidin vs control",98a,29061669,"MaxQuant Score",149.4000000,1.0000000,1.7510000,0.0004406,YES,7.1000002322195E-17,
KSAPTTGGVKKPHR,ac,K,37,false,"Histone deacetylases- hda14 vs WT (low light)",98c,29061669,"MaxQuant Score",171.2600000,1.0000000,-1.0460000,0.9885531,NO,8.1999997070259E-12,
KSAPTTGGVKKPHR,ac,K,37,false,"Histone deacetylases substrates - hda14 vs WT",98e,29061669,"MaxQuant Score",150.8000000,1.0000000,-0.1310000,0.8709636,NO,3.3631163143796E-44,
KSAPTTGGVKKPHR,ac,K,37,false,"Quantitative Acetylproteomics",101,29440448,,,,,,,,
SAPTTGGVKKPHR,ac,K,37,false,"Histone deacetylases- hda14 vs WT (low light)",98c,29061669,"MaxQuant Score",171.2600000,1.0000000,-1.0460000,0.9885531,NO,8.1999997070259E-12,
SAPTTGGVKKPHR,ac,K,37,false,"Histone deacetylases substrates - hda14 vs WT",98e,29061669,"MaxQuant Score",150.8000000,1.0000000,-0.1310000,0.8709636,NO,3.3631163143796E-44,
SAPTTGGVKKPHR,ac,K,37,false,"Quantitative Acetylproteomics",101,29440448,,,,,,,,
SAPTTGGVKKPHR,hib,K,37,false,"Histone Khib and acetylation, dark-induced starvat",137,34165567,,,0.8567850,,,,,
KSAPTTGGVKKPHR,me1,K,37,false,"Arabidopsis protein methylome",123,31809900,"MaxQuant Score",44.9250000,1.0000000,,,,0.0088568199425936,-0.7000900
KSAPTTGGVKK,me2,K,37,false,"Arabidopsis protein methylome",123,31809900,"MaxQuant Score",105.0300000,1.0000000,,,,4.9011898227036E-5,-0.6724000
SAPTTGGVKK,me2,K,37,false,"Arabidopsis protein methylome",123,31809900,"MaxQuant Score",152.5400000,1.0000000,,,,3.9730899565364E-29,-0.2273900
KSAPTTGGVKKPHR,ub,K,37,false,"Ubiquitination Membrane Proteins",120,33585938,,,,,,,,
KSAPTTGGVKKPHR,ac,K,38,false,"Histone deacetylases - apicidin vs control",98a,29061669,"MaxQuant Score",149.4000000,1.0000000,1.7510000,0.0004406,YES,7.1000002322195E-17,
KSAPTTGGVKKPHR,ac,K,38,false,"Histone deacetylases- hda14 vs WT (low light)",98c,29061669,"MaxQuant Score",171.2600000,1.0000000,-1.0460000,0.9885531,NO,8.1999997070259E-12,
KSAPTTGGVKKPHR,ac,K,38,false,"Histone deacetylases substrates - hda14 vs WT",98e,29061669,"MaxQuant Score",150.8000000,1.0000000,-0.1310000,0.8709636,NO,3.3631163143796E-44,
KSAPTTGGVKKPHR,ac,K,38,false,"Quantitative Acetylproteomics",101,29440448,,,,,,,,
SAPTTGGVKKPHR,ac,K,38,false,"Histone deacetylases- hda14 vs WT (low light)",98c,29061669,"MaxQuant Score",171.2600000,1.0000000,-1.0460000,0.9885531,NO,8.1999997070259E-12,
SAPTTGGVKKPHR,ac,K,38,false,"Histone deacetylases substrates - hda14 vs WT",98e,29061669,"MaxQuant Score",150.8000000,1.0000000,-0.1310000,0.8709636,NO,3.3631163143796E-44,
SAPTTGGVKKPHR,ac,K,38,false,"Quantitative Acetylproteomics",101,29440448,,,,,,,,
KSAPTTGGVKKPHR,me1,K,38,false,"Arabidopsis protein methylome",123,31809900,"MaxQuant Score",44.9250000,1.0000000,,,,0.0088568199425936,-0.7000900
KYQKSTELLIR,hib,K,54,false,"Histone Khib and acetylation, dark-induced starvat",137,34165567,,,0.8865540,,,,,
KYQKSTELLIR,ub,K,54,false,"Arabidopsis ubiquitination COFRADIC",40,26744219,"MaxQuant Score",90.6140000,1.0000000,,,,0.00020450000010896,0.1150000
KYQKSTELLIR,ub,K,54,false,"Ubiquitination Membrane Proteins",120,33585938,,,,,,,,
YQKSTELLIR,hib,K,57,false,"Histone Khib and acetylation, dark-induced starvat",137,34165567,,,1.0000000,,,,,
KYQKSTELLIR,ub,K,57,false,"Arabidopsis ubiquitination COFRADIC",40,26744219,"MaxQuant Score",138.4500000,1.0000000,,,,8.3480002424641E-12,-0.0060000
KYQKSTELLIR,ub,K,57,false,"Ubiquitination Membrane Proteins",120,33585938,,,,,,,,
YQKSTELLIR,ub,K,57,false,"upl3 mutant / wildtype",168,35926874,"MaxQuant score",96.3420000,1.0000000,0.8559897,0.1123810,NO,0.00037671599420719,0.2585600
