Peptide,PTM,ModifiedAA,ModifiedPosition,PeptideUniqueToGene,ExperimentDesc,ExpID,PubmedID,ScoreType,IdentScore,LocProb,Log2FChange,PQ-val,QuantSig,PEP,MassErrorPPM
LAQLASLQHHSASSR,ph,S,175,true,"Tissue atlas Arabidopsis - ProteomicsDB",114,32188942,"MaxQuant score",89.8590000,0.9995330,,,,2.739090086834E-5,
LAQLASLQHHSASSR,ph,S,180,true,"Tissue atlas Arabidopsis - ProteomicsDB",114,32188942,"MaxQuant score",153.2500000,0.8804840,,,,1.0761199969096E-22,
LAQLASLQHHSASSR,ph,S,182,true,"Tissue atlas Arabidopsis - ProteomicsDB",114,32188942,"MaxQuant score",143.3300000,0.8053650,,,,1.0761199969096E-22,
EASGGDNNDDKDHSGGGGSALANTR,ph,S,196,true,"Tissue atlas Arabidopsis - ProteomicsDB",114,32188942,"MaxQuant score",175.3300000,1.0000000,,,,0,
EASGGDNNDDKDHSGGGGSALANTR,ph,S,207,true,"Col-0 callus - FC Col-0 vs. Col-0 Xray",111a,31410901,,46.8100000,,-1.5529279,0.0000000,NO,,0.1625354
EASGGDNNDDKDHSGGGGSALANTR,ph,S,207,true,"Col-0 X-ray callus - FC Col-0 vs. Col-0 Xray",111b,31410901,,46.8100000,,-1.5529279,0.0000000,NO,,0.1625354
EASGGDNNDDKDHSGGGGSALANTR,ph,S,207,true,"atm callus - FC atm vs. atm Xray",111c,31410901,,46.8100000,,4.0981567,0.0000000,NO,,0.1625354
EASGGDNNDDKDHSGGGGSALANTR,ph,S,207,true,"atm-3 X-ray callus - FC atm vs. atm Xray",111d,31410901,,46.8100000,,4.0981567,0.0000000,NO,,0.1625354
EASGGDNNDDKDHSGGGGSALANTR,ph,S,207,true,"Tissue atlas Arabidopsis - ProteomicsDB",114,32188942,"MaxQuant score",203.8200000,0.9982350,,,,0,
EASGGDNNDDKDHSGGGGSALANTR,ph,S,212,true,"Col-0 callus - FC Col-0 vs. Col-0 Xray",111a,31410901,,23.4900000,,3.7354612,0.0000000,NO,,0.4887866
EASGGDNNDDKDHSGGGGSALANTR,ph,S,212,true,"Col-0 X-ray callus - FC Col-0 vs. Col-0 Xray",111b,31410901,,23.4900000,,3.7354612,0.0000000,NO,,0.4887866
EASGGDNNDDKDHSGGGGSALANTR,ph,S,212,true,"atm callus - FC atm vs. atm Xray",111c,31410901,,23.4900000,,-1.3267439,0.0000000,NO,,0.4887866
EASGGDNNDDKDHSGGGGSALANTR,ph,S,212,true,"atm-3 X-ray callus - FC atm vs. atm Xray",111d,31410901,,23.4900000,,-1.3267439,0.0000000,NO,,0.4887866
VVNANSNSGLEVSQHLPPEVNSPAIFR,ph,S,226,true,"Tissue atlas Arabidopsis - ProteomicsDB",114,32188942,"MaxQuant score",207.6900000,0.9981650,,,,0,
