Peptide,PTM,ModifiedAA,ModifiedPosition,PeptideUniqueToGene,ExperimentDesc,ExpID,PubmedID,ScoreType,IdentScore,LocProb,Log2FChange,PQ-val,QuantSig,PEP,MassErrorPPM
FAALEKAAIQSSAEHGIER,ub,K,352,true,"upl3 mutant / wildtype",168,35926874,"MaxQuant score",99.0920000,1.0000000,,,,3.2493499446673E-8,0.0319690
AAIQSSAEHGIER,ph,S,357,true,"Tissue atlas Arabidopsis - ProteomicsDB",114,32188942,"MaxQuant score",61.8150000,0.8285510,,,,0.001696559949778,
AAIQSSAEHGIER,ph,S,358,true,"Tissue atlas Arabidopsis - ProteomicsDB",114,32188942,"MaxQuant score",88.3850000,0.9797190,,,,0.00045593100367114,
APVSRNSIK,ph,S,372,true,"STN8 phosphoproteome",38,21768351,"MASCOT Score",41.3100000,,,,,,1.3506600
APVSRNSIK,ph,S,372,true,"Chloroplast kinase substrates",60,19376835,"MASCOT Score",52.2300000,,,,,,-0.3594960
APVSRNSIK,ph,S,372,true,"Tissue atlas Arabidopsis - ProteomicsDB",114,32188942,"MaxQuant score",152.3100000,0.9998860,,,,0.00020448300347198,
NSIKSSITTPLLHQSTDNV,ub,K,374,true,"Ubiquitination Membrane Proteins",120,33585938,,,,,,,,
SSITTPLLHQSTDNV,ph,T,378,true,"Tissue atlas Arabidopsis - ProteomicsDB",114,32188942,"MaxQuant score",164.2800000,0.9975480,,,,1.6473900152011E-12,
SSITTPLLHQSTDNV,ph,T,379,true,"Tissue atlas Arabidopsis - ProteomicsDB",114,32188942,"MaxQuant score",101.8800000,0.9060400,,,,4.9969101382885E-5,
SSITTPLLHQSTDNV,ph,S,385,true,"TOR Kinase and ABA Receptor",100,29290610,XCorr,3.0367026,0.9043000,,,,0.0019580000080168,
SSITTPLLHQSTDNV,ph,T,386,true,"Tissue atlas Arabidopsis - ProteomicsDB",114,32188942,"MaxQuant score",138.3300000,0.9076950,,,,2.0077600311197E-6,
