Peptide,PTM,ModifiedAA,ModifiedPosition,PeptideUniqueToGene,ExperimentDesc,ExpID,PubmedID,ScoreType,IdentScore,LocProb,Log2FChange,PQ-val,QuantSig,PEP,MassErrorPPM
QASSVTSPSSPSDVK,nta,Q,53,true,"Characterization plant N-terminal acetylation",6,22223895,"MASCOT Score",66.7100000,,,,,,
ASSVTSPSSPSDVKGKSDLKD,nt,A,54,true,"HUNTER N-terminome: legumain, GluC and trypsin",119,31951383,"MaxQuant score",111.5700000,,,,,,
ASSVTSPSSPSDVKGK,nt,A,54,true,"N-terminal ChaFRADIC",92,26010716,"MASCOT Score",22.9500000,,,,,3.4590000723256E-5,
ASSVTSPSSPSDVK,nt,A,54,true,"Stromal N-terminome",96,26371235,"MASCOT Score",59.8300000,,,,,,
ASSVTSPSSPSDVKGKSDLKDFLAIDD,nta,A,54,true,"HUNTER N-terminome: legumain, GluC and trypsin",119,31951383,"MaxQuant score",,,,,,,
ASSVTSPSSPSDVKGKSDLKD,nta,A,54,true,"HUNTER N-terminome: legumain, GluC and trypsin",119,31951383,"MaxQuant score",56.3270000,,,,,,
ASSVTSPSSPSDVKGKSDLKD,nta,A,54,true,"Arabidopsis translation initiation landscape - NTA",167a,35069635,,,,,,,,
ASSVTSPSSPSDVKGKSD,nta,A,54,true,"HUNTER N-terminome: legumain, GluC and trypsin",119,31951383,"MaxQuant score",76.5880000,,,,,,
ASSVTSPSSPSDVKGK,nta,A,54,true,"N-terminal ChaFRADIC",92,26010716,"MASCOT Score",22.9500000,,,,,3.4590000723256E-5,
ASSVTSPSSPSDVK,nta,A,54,true,"Characterization plant N-terminal acetylation",6,22223895,"MASCOT Score",75.4000000,,,,,,
ASSVTSPSSPSDVK,nta,A,54,true,"Stromal N-terminome",96,26371235,"MASCOT Score",59.8300000,,,,,,
SSVTSPSSPSDVKGKSDLKD,nt,S,55,true,"HUNTER N-terminome: legumain, GluC and trypsin",119,31951383,"MaxQuant score",75.1220000,,,,,,
SSVTSPSSPSDVK,nt,S,55,true,"N-terminal ChaFRADIC",92,26010716,"MASCOT Score",69.1200000,,,,,2.03399995371E-5,
SSVTSPSSPS,nt,S,55,true,"N-terminal ChaFRADIC",92,26010716,"MASCOT Score",27.5800000,,,,,0.028680000454187,
SSVTSPSSPSDVK,nta,S,55,true,"N-terminal ChaFRADIC",92,26010716,"MASCOT Score",69.1200000,,,,,2.03399995371E-5,
TILDKASEVK,ac,K,92,true,"Quantitative Acetylproteomics",101,29440448,,,,,,,,
GYEPDKER,ac,K,260,true,"Histone deacetylases substrates - hda14 vs WT",98e,29061669,"MaxQuant Score",49.7000000,1.0000000,-0.1840000,0.8016781,NO,0.026000000536442,
GYEPDKER,ac,K,260,true,"Quantitative Acetylproteomics",101,29440448,,,,,,,,
QAGLSKIEITNDPK,ac,K,273,true,"Quantitative Acetylproteomics",101,29440448,,,,,,,,
KAFQGFQVDEALMKLAGQK,ub,K,322,true,"Protein ubiquitination during photomorphogenesis",3,28461270,,,,,,,,
AYFMHCLPAER,ox,C,333,true,"SPEAR - 50 mM H2O2 / mock",138b,34619326,,,,1.3747002,0.0316210,YES,,
GVEVTNGVVEAPYSIVFPQAENR,nt,G,339,true,"Arabidopsis translation initiation landscape - NT",167b,35069635,,,,,,,,
