Peptide,PTM,ModifiedAA,ModifiedPosition,PeptideUniqueToGene,ExperimentDesc,ExpID,PubmedID,ScoreType,IdentScore,LocProb,Log2FChange,PQ-val,QuantSig,PEP,MassErrorPPM
VSCNSQTLDHHQSK,ph,S,50,true,"atm and atr DNA damage response",88,25561503,"MASCOT Score",55.0000000,1.0000000,,,,,-1.6400000
VSCNSQTLDHHQSK,ph,S,50,true,"Tissue atlas Arabidopsis - ProteomicsDB",114,32188942,"MaxQuant score",106.3100000,0.9510300,,,,2.4627099264762E-5,
SPSSFSISAAAKPTVR,ph,S,60,true,"TOR Kinase and ABA Receptor",100,29290610,XCorr,2.0579491,0.9982000,,,,0.00014390000433195,
SPSSFSISAAAKPTVR,ph,S,60,true,"Tissue atlas Arabidopsis - ProteomicsDB",114,32188942,"MaxQuant score",241.8700000,0.9967370,,,,0,
SPSSFSISAAAK,ph,S,60,true,"atm and atr DNA damage response",88,25561503,"MASCOT Score",57.0000000,1.0000000,,,,,0.8200000
SPSSFSISAAAK,ph,S,62,true,"Tissue atlas Arabidopsis - ProteomicsDB",114,32188942,"MaxQuant score",160.5600000,0.8663250,,,,5.7708499090481E-10,
FTTDQKER,ph,T,248,true,"atm and atr DNA damage response",88,25561503,"MASCOT Score",26.0000000,0.9320000,,,,,-1.5600000
FTTDQKER,ph,T,249,true,"atm and atr DNA damage response",88,25561503,"MASCOT Score",26.0000000,0.9320000,,,,,-0.4200000
KPPTPTTTL,ph,T,304,true,"Large-scale phosphorylation discovery",44,23111157,XCorr,2.9210000,,,,,,
KPPTPTTTL,ph,T,304,true,"Tissue atlas Arabidopsis - ProteomicsDB",114,32188942,"MaxQuant score",143.9600000,0.9987060,,,,0.00021984599879943,
KPPTPTTTL,og,T,307,true,"O-GlcNac Inflorescence Tissue",81,28154133,"MASCOT Score",21.6000000,,,,,,3.9000000
KPPTPTTTL,ph,T,308,true,"atm and atr DNA damage response",88,25561503,"MASCOT Score",27.0000000,0.9420000,,,,,-1.1200000
KPPTPTTTL,ph,T,308,true,"TOR Kinase and ABA Receptor",100,29290610,XCorr,2.9053390,0.9897000,,,,0.022579999640584,
KPPTPTTTL,ph,T,308,true,"Tissue atlas Arabidopsis - ProteomicsDB",114,32188942,"MaxQuant score",115.7800000,0.9909760,,,,0.00090958800865337,
