Peptide,PTM,ModifiedAA,ModifiedPosition,PeptideUniqueToGene,ExperimentDesc,ExpID,PubmedID,ScoreType,IdentScore,LocProb,Log2FChange,PQ-val,QuantSig,PEP,MassErrorPPM
SFRDDNEEAR,nta,S,2,true,"Characterization plant N-terminal acetylation",6,22223895,"MASCOT Score",36.4300000,,,,,,
SFRDDNEEARNDLR,ph,S,2,true,"SIRK1 phosphorylation",86a,23820729,"MaxQuant Score",108.6700000,1.0000000,,,,0.11200000345707,8.7960000
SFRDDNEEARNDLR,ph,S,2,true,"SIRK1 exp - sirk1 mutant vs WT",86b,23820729,,,,-0.6573436,,NO,,
SFRDDNEEARNDLR,ph,S,2,true,"SIRK1 exp - 35S:SIRK1 vs WT",86c,23820729,,,,-2.0611479,,NO,,
SFRDDNEEARNDLR,ph,S,2,true,"Tissue atlas Arabidopsis - ProteomicsDB",114,32188942,"MaxQuant score",162.4900000,1.0000000,,,,1.0345100065479E-7,
SFRDDNEEAR,ph,S,2,true,"SIRK1 phosphorylation",86a,23820729,"MaxQuant Score",122.4500000,1.0000000,,,,0.013000000268221,10.0290000
SFRDDNEEAR,ph,S,2,true,"SIRK1 exp - sirk1 mutant vs WT",86b,23820729,,,,-2.3053620,,NO,,
SFRDDNEEAR,ph,S,2,true,"SIRK1 exp - 35S:SIRK1 vs WT",86c,23820729,,,,0.1949994,,NO,,
SFRDDNEEAR,ph,S,2,true,"atm and atr DNA damage response",88,25561503,"MASCOT Score",44.0000000,1.0000000,,,,,-0.2300000
SFRDDNEEAR,ph,S,2,true,"Phospho cell culture sucrose/TOR",109,30833711,,,1.0000000,,,,,
RPFIHTGSWYR,ph,S,23,true,"Phosphoproteome ethylene-regulated time response",46,24043427,"MASCOT Score",47.4000000,,,,,,-23.3453000
RPFIHTGSWYR,ph,S,23,true,"atm and atr DNA damage response",88,25561503,"MASCOT Score",29.0000000,0.9480000,,,,,0.1600000
RPFIHTGSWYR,ph,S,23,true,"TOR Kinase and ABA Receptor",100,29290610,XCorr,3.5273445,0.9926000,,,,0.0024349999148399,
QSSMMGSSQVIR,ph,S,32,true,"atm and atr DNA damage response",88,25561503,"MASCOT Score",30.0000000,0.9820000,,,,,-2.4600000
QSSMMGSSQVIR,ph,S,33,true,"Large-scale phosphorylation discovery",44,23111157,XCorr,3.3480000,,,,,,
QSSMMGSSQVIR,ph,S,33,true,"atm and atr DNA damage response",88,25561503,"MASCOT Score",65.0000000,0.9960000,,,,,-0.1900000
QSSMMGSSQVIR,ph,S,33,true,"TOR Kinase and ABA Receptor",100,29290610,XCorr,3.2351139,0.9006000,,,,0.0013810000382364,
QSSMMGSSQVIR,ph,S,33,true,"Tissue atlas Arabidopsis - ProteomicsDB",114,32188942,"MaxQuant score",221.5600000,0.9999930,,,,2.2781399588991E-39,
QSSMMGSSQVIR,ph,S,37,true,"atm and atr DNA damage response",88,25561503,"MASCOT Score",68.0000000,0.9280000,,,,,1.5400000
QSSMMGSSQVIR,ph,S,37,true,"Tissue atlas Arabidopsis - ProteomicsDB",114,32188942,"MaxQuant score",161.0400000,1.0000000,,,,4.2573899960985E-10,
QSSMMGSSQVIR,ph,S,38,true,"atm and atr DNA damage response",88,25561503,"MASCOT Score",52.0000000,1.0000000,,,,,-0.0200000
QSSMMGSSQVIR,ph,S,38,true,"Tissue atlas Arabidopsis - ProteomicsDB",114,32188942,"MaxQuant score",206.4900000,1.0000000,,,,7.2770999637937E-31,
WLAKMGMTDEFETSLQVLR,ph,T,233,true,"SnRK2 protein kinase substrates",85,23776212,XCorr,2.0675704,0.8540000,,,,0.12546199560165,
SVASSTKR,ac,K,266,true,"Quantitative Acetylproteomics",101,29440448,,,,,,,,
