Peptide,PTM,ModifiedAA,ModifiedPosition,PeptideUniqueToGene,ExperimentDesc,ExpID,PubmedID,ScoreType,IdentScore,LocProb,Log2FChange,PQ-val,QuantSig,PEP,MassErrorPPM
MQTLPSSETVLLGSNSAPPVLR,nta,M,1,true,"HUNTER N-terminome: legumain, GluC and trypsin",119,31951383,"MaxQuant score",122.3400000,,,,,,
SPGGDDVDIDFGDVFGGPPK,ph,S,23,true,"Touch-induced phosphorylation: 40s touch vs untouc",136,30291188,"MASCOT score",133.9600000,,-0.0047002,0.9853140,NO,,6.3782970
VTSNEVTRHSFSESALR,ph,T,53,true,"Tissue atlas Arabidopsis - ProteomicsDB",114,32188942,"MaxQuant score",151.9600000,0.8835530,,,,4.5176899330854E-13,
VTSNEVTRHSFSESALR,ph,S,56,true,"srk2dei ABA signaling phopshoproteomics",83,23572148,"MASCOT Score",28.0000000,,,,,,0.0010000
VTSNEVTRHSFSESALR,ph,S,56,true,"atm and atr DNA damage response",88,25561503,"MASCOT Score",42.0000000,1.0000000,,,,,-0.3000000
HSFSESALR,ph,S,56,true,"STN8 phosphoproteome",38,21768351,"MASCOT Score",51.1200000,,,,,,-3.8756900
HSFSESALR,ph,S,56,true,"Chloroplast kinase substrates",60,19376835,"MASCOT Score",43.3600000,,,,,,1.2567500
HSFSESALR,ph,S,56,true,"srk2dei ABA signaling phopshoproteomics",83,23572148,"MASCOT Score",38.0000000,,,,,,-0.0006000
HSFSESALR,ph,S,56,true,"atm and atr DNA damage response",88,25561503,"MASCOT Score",31.0000000,0.9990000,,,,,0.0700000
HSFSESALR,ph,S,56,true,"Tissue atlas Arabidopsis - ProteomicsDB",114,32188942,"MaxQuant score",217.7100000,0.9999450,,,,0,
VTSNEVTRHSFSESALR,ph,S,58,true,"TOR Kinase and ABA Receptor",100,29290610,XCorr,3.0904105,0.8903000,,,,0.00021230000129435,
VNESSSLPGSR,ph,S,111,true,"STN8 phosphoproteome",38,21768351,"MASCOT Score",44.2400000,,,,,,-2.2598300
VNESSSLPGSR,ph,S,111,true,"Chloroplast kinase substrates",60,19376835,"MASCOT Score",34.8800000,,,,,,0.2122870
VNESSSLPGSR,ph,S,111,true,"atm and atr DNA damage response",88,25561503,"MASCOT Score",63.0000000,0.9410000,,,,,-0.4400000
VNESSSLPGSR,ph,S,111,true,"TOR Kinase and ABA Receptor",100,29290610,XCorr,2.5501378,0.8257000,,,,0.00037940000765957,
VNESSSLPGSR,ph,S,111,true,"Tissue atlas Arabidopsis - ProteomicsDB",114,32188942,"MaxQuant score",179.6700000,0.9464160,,,,5.4169000421279E-14,
VNESSSLPGSR,ph,S,115,true,"atm and atr DNA damage response",88,25561503,"MASCOT Score",63.0000000,1.0000000,,,,,-0.4400000
VNESSSLPGSR,ph,S,115,true,"Tissue atlas Arabidopsis - ProteomicsDB",114,32188942,"MaxQuant score",123.6800000,0.9997400,,,,1.3742799637839E-5,
ILSPAHKPESSSGTSSPSQFSLPAK,ph,S,119,true,"STN8 phosphoproteome",38,21768351,"MASCOT Score",50.5000000,,,,,,
ILSPAHKPESSSGTSSPSQFSLPAK,ph,S,119,true,"MAPK Arabidopsis substrates",45,23172892,"MaxQuant Score",48.7600000,,,,,,
ILSPAHKPESSSGTSSPSQFSLPAK,ph,S,119,true,"LAXIC - mannitol vs control",84b,23660473,XCorr,5.3800000,0.8250000,,,,0.00054470798932016,
ILSPAHKPESSSGTSSPSQFSLPAK,ph,S,119,true,"Tissue atlas Arabidopsis - ProteomicsDB",114,32188942,"MaxQuant score",202.5600000,1.0000000,,,,0,
ILSPAHKPESSSGTSSPSQFSLPAK,ph,S,126,true,"MAPK Arabidopsis substrates",45,23172892,"MaxQuant Score",48.7600000,,,,,,
ILSPAHKPESSSGTSSPSQFSLPAK,ph,S,127,true,"MAPK Arabidopsis substrates",45,23172892,"MaxQuant Score",48.7600000,,,,,,
ILSPAHKPESSSGTSSPSQFSLPAK,ph,S,127,true,"srk2dei ABA signaling phopshoproteomics",83,23572148,"MASCOT Score",27.0000000,,,,,,-0.0002000
ILSPAHKPESSSGTSSPSQFSLPAK,ph,S,127,true,"TOR Kinase and ABA Receptor",100,29290610,XCorr,4.8779879,0.8189000,,,,7.4570001743268E-5,
ILSPAHKPESSSGTSSPSQFSLPAK,ph,S,128,true,"MAPK Arabidopsis substrates",45,23172892,"MaxQuant Score",57.4840000,,,,,,
ILSPAHKPESSSGTSSPSQFSLPAK,ph,S,128,true,"srk2dei ABA signaling phopshoproteomics",83,23572148,"MASCOT Score",27.0000000,,,,,,-0.0002000
ILSPAHKPESSSGTSSPSQFSLPAK,ph,T,130,true,"srk2dei ABA signaling phopshoproteomics",83,23572148,"MASCOT Score",27.0000000,,,,,,-0.0002000
ILSPAHKPESSSGTSSPSQFSLPAK,ph,S,131,true,"MAPK Arabidopsis substrates",45,23172892,"MaxQuant Score",51.9660000,,,,,,
ILSPAHKPESSSGTSSPSQFSLPAK,ph,S,131,true,"srk2dei ABA signaling phopshoproteomics",83,23572148,"MASCOT Score",25.0000000,,,,,,0.0005000
ILSPAHKPESSSGTSSPSQFSLPAK,ph,S,132,true,"TOR Kinase and ABA Receptor",100,29290610,XCorr,4.8779879,0.8993000,,,,7.4570001743268E-5,
ILSPAHKPESSSGTSSPSQFSLPAK,ph,S,132,true,"Tissue atlas Arabidopsis - ProteomicsDB",114,32188942,"MaxQuant score",200.8700000,0.9744280,,,,0,
ETVSSSPLSR,ph,S,165,true,"atm and atr DNA damage response",88,25561503,"MASCOT Score",39.0000000,0.9880000,,,,,0.7500000
ETVSSSPLSR,ph,S,166,true,"atm and atr DNA damage response",88,25561503,"MASCOT Score",32.0000000,0.9350000,,,,,-0.2000000
ETVSSSPLSR,ph,S,166,true,"Tissue atlas Arabidopsis - ProteomicsDB",114,32188942,"MaxQuant score",213.9900000,0.9368550,,,,1.3610000632176E-38,
NKETVSSSPLSR,ph,S,169,true,"STN8 phosphoproteome",38,21768351,"MASCOT Score",80.3200000,,,,,,0.1411730
NKETVSSSPLSR,ph,S,169,true,"Chloroplast kinase substrates",60,19376835,"MASCOT Score",41.8500000,,,,,,-0.7970120
NKETVSSSPLSR,ph,S,169,true,"atm and atr DNA damage response",88,25561503,"MASCOT Score",38.0000000,1.0000000,,,,,-0.1000000
NKETVSSSPLSR,ph,S,169,true,"Protein sumoylation and phosphorylation cross-talk",97,28419593,,,,,,,,
NKETVSSSPLSR,ph,S,169,true,"Tissue atlas Arabidopsis - ProteomicsDB",114,32188942,"MaxQuant score",176.5600000,0.9996120,,,,2.9775700490436E-15,
ETVSSSPLSR,ph,S,169,true,"STN8 phosphoproteome",38,21768351,"MASCOT Score",47.6000000,,,,,,0.3197310
ETVSSSPLSR,ph,S,169,true,"srk2dei ABA signaling phopshoproteomics",83,23572148,"MASCOT Score",30.0000000,,,,,,-0.0009000
ETVSSSPLSR,ph,S,169,true,"atm and atr DNA damage response",88,25561503,"MASCOT Score",32.0000000,1.0000000,,,,,-0.2000000
ETVSSSPLSR,ph,S,169,true,"TOR Kinase and ABA Receptor",100,29290610,XCorr,2.6433861,0.9885000,,,,0.011979999952018,
ETVSSSPLSRTSSK,ph,S,172,true,"TOR Kinase and ABA Receptor",100,29290610,XCorr,3.4115784,0.8722000,,,,0.0071390001103282,
TSSKADVVSTAK,ph,S,173,true,"STN8 phosphoproteome",38,21768351,"MASCOT Score",46.8100000,,,,,,-0.6333510
TSSKADVVSTAK,ph,S,173,true,"Chloroplast kinase substrates",60,19376835,"MASCOT Score",34.0200000,,,,,,-0.1603490
TSSKADVVSTAK,ph,S,173,true,"atm and atr DNA damage response",88,25561503,"MASCOT Score",48.0000000,0.9480000,,,,,-1.6100000
TSSKADVVSTAK,ph,S,173,true,"Protein sumoylation and phosphorylation cross-talk",97,28419593,,,,,,,,
TSSKADVVSTAK,ph,S,173,true,"Tissue atlas Arabidopsis - ProteomicsDB",114,32188942,"MaxQuant score",163.8200000,0.9997480,,,,4.2400000177523E-10,
SQGTKSSLDSSPIPDK,ph,S,384,true,"Tissue atlas Arabidopsis - ProteomicsDB",114,32188942,"MaxQuant score",100.1100000,0.9374220,,,,1.1982700016233E-5,
SSLDSSPIPDK,ph,S,388,true,"Chloroplast kinase substrates",60,19376835,"MASCOT Score",39.6100000,,,,,,-0.4030700
SSLDSSPIPDK,ph,S,388,true,"srk2dei ABA signaling phopshoproteomics",83,23572148,"MASCOT Score",28.0000000,,,,,,-0.0011000
SSLDSSPIPDK,ph,S,388,true,"TOR Kinase and ABA Receptor",100,29290610,XCorr,2.8056037,0.9932000,,,,0.00031810000655241,
SSLDSSPIPDK,ph,S,388,true,"Tissue atlas Arabidopsis - ProteomicsDB",114,32188942,"MaxQuant score",138.2000000,0.9718280,,,,5.3189901485021E-13,
IFSKGASVGAGGESLGQSSR,ph,S,422,true,"MAPK Arabidopsis substrates",45,23172892,"MaxQuant Score",56.8170000,,,,,,
GASVGAGGESLGQSSR,ph,S,426,true,"atm and atr DNA damage response",88,25561503,"MASCOT Score",94.0000000,0.8960000,,,,,1.8500000
GASVGAGGESLGQSSR,ph,S,426,true,"Tissue atlas Arabidopsis - ProteomicsDB",114,32188942,"MaxQuant score",138.8700000,1.0000000,,,,2.6054399526743E-8,
GASVGAGGESLGQSSR,ph,S,433,true,"atm and atr DNA damage response",88,25561503,"MASCOT Score",114.0000000,1.0000000,,,,,0.2500000
GASVGAGGESLGQSSR,ph,S,437,true,"srk2dei ABA signaling phopshoproteomics",83,23572148,"MASCOT Score",91.0000000,,,,,,0.0001000
GASVGAGGESLGQSSR,ph,S,437,true,"atm and atr DNA damage response",88,25561503,"MASCOT Score",45.0000000,0.9950000,,,,,0.5700000
GASVGAGGESLGQSSR,ph,S,437,true,"Protein sumoylation and phosphorylation cross-talk",97,28419593,,,,,,,,
GASVGAGGESLGQSSR,ph,S,437,true,"TOR Kinase and ABA Receptor",100,29290610,XCorr,5.1774678,0.9100000,,,,1.4469999598532E-7,
GASVGAGGESLGQSSR,ph,S,437,true,"Tissue atlas Arabidopsis - ProteomicsDB",114,32188942,"MaxQuant score",323.0900000,0.8820800,,,,0,
GASVGAGGESLGQSSR,ph,S,438,true,"atm and atr DNA damage response",88,25561503,"MASCOT Score",94.0000000,0.8970000,,,,,1.8500000
STPDIPAMNR,ph,S,470,true,"atm and atr DNA damage response",88,25561503,"MASCOT Score",37.0000000,1.0000000,,,,,-0.0300000
