Peptide,PTM,ModifiedAA,ModifiedPosition,PeptideUniqueToGene,ExperimentDesc,ExpID,PubmedID,ScoreType,IdentScore,LocProb,Log2FChange,PQ-val,QuantSig,PEP,MassErrorPPM
TVSAPPEEEEIVELKK,nt,T,53,true,"Stromal N-terminome",96,26371235,"MASCOT Score",51.6400000,,,,,,
TVSAPPEEEEIVELK,nt,T,53,true,"N-terminal ChaFRADIC",92,26010716,"MASCOT Score",60.3400000,,,,,4.4059997890145E-6,
TVSAPPEEEEIVEL,nt,T,53,true,"N-terminal ChaFRADIC",92,26010716,"MASCOT Score",27.7700000,,,,,0.00062469998374581,
TVSAPPEEEEIVELKKYVKSR,nta,T,53,true,"HUNTER N-terminome: legumain, GluC and trypsin",119,31951383,"MaxQuant score",105.7700000,,,,,,
TVSAPPEEEEIVELKK,nta,T,53,true,"Stromal N-terminome",96,26371235,"MASCOT Score",51.6400000,,,,,,
TVSAPPEEEEIVELK,nta,T,53,true,"Characterization plant N-terminal acetylation",6,22223895,"MASCOT Score",40.5000000,,,,,,
TVSAPPEEEEIVELK,nta,T,53,true,"N-terminal ChaFRADIC",92,26010716,"MASCOT Score",60.3400000,,,,,4.4059997890145E-6,
TVSAPPEEEE,nta,T,53,true,"HUNTER N-terminome: legumain, GluC and trypsin",119,31951383,"MaxQuant score",205.7000000,,,,,,
ALLKVSADHR,ac,K,167,true,"Histone deacetylases substrates - TSA vs control",98b,29061669,"MaxQuant Score",60.3000000,1.0000000,-0.1570000,0.9977001,NO,0.0020000000949949,
SPLKKEGLLTR,nt,S,174,true,"Arabidopsis translation initiation landscape - NT",167b,35069635,,,,,,,,
VSADHRSPLKK,ph,S,174,true,"Phospho cell culture sucrose/TOR",109,30833711,,,0.9999360,,,,,
VSADHRSPLKK,ph,S,174,true,"Tissue atlas Arabidopsis - ProteomicsDB",114,32188942,"MaxQuant score",72.6810000,0.9999500,,,,0.00076260400237516,
KAPQFSKR,ac,K,207,true,"Quantitative Acetylproteomics",101,29440448,,,,,,,,
