Peptide,PTM,ModifiedAA,ModifiedPosition,PeptideUniqueToGene,ExperimentDesc,ExpID,PubmedID,ScoreType,IdentScore,LocProb,Log2FChange,PQ-val,QuantSig,PEP,MassErrorPPM
SSGGAMAVME,nt,S,105,true,"N-terminal ChaFRADIC",92,26010716,"MASCOT Score",28.7300000,,,,,0.0046140002086759,
SSGGAMAVME,nt,S,105,true,"Arg/N-end rule seed, prt6 vs. Wt",99,29168982,"MASCOT Score",40.3500000,,0.0260088,0.9130666,NO,0.011160000227392,-3.8913411
VMEMEKEAAVNKKPPTEQR,nt,V,112,true,"Stromal N-terminome",96,26371235,"MASCOT Score",34.7300000,,,,,,
VMEMEKEAAVNKKPPTEQR,nt,V,112,true,"FtsH12 N-terminome: WT / FtsH12 knockdown miRNA",118,33216923,"MaxQuant score",78.6920000,,,,,5.809999856865E-5,
VMEMEKEAAVNKKPPTEQR,nta,V,112,true,"Stromal N-terminome",96,26371235,"MASCOT Score",34.7300000,,,,,,
VMEMEKEAAVN,nta,V,112,true,"HUNTER N-terminome: legumain, GluC and trypsin",119,31951383,"MaxQuant score",,,,,,,
CGVLIGSAMGGMK,acy,C,230,true,"Arabidopsis S-acylation atlas - Meristem",163a,35681017,,,,,,,,
QINYINAHATSTHAGDIKE,nt,Q,425,true,"HUNTER N-terminome: legumain, GluC and trypsin",119,31951383,"MaxQuant score",,,,,,,
EQINYINAHATSTHAGDIKEYQALAHCFGQNPELK,ac,K,442,true,"Histone deacetylases- hda14 vs WT (low light)",98c,29061669,"MaxQuant Score",139.7200000,1.0000000,-0.2120000,0.9885531,NO,3.9000000856156E-17,
EYQALAHCFGQNPELK,sno,C,450,true,"hot5-4 / wildtype, FAT-switch S-nitrosoproteome",169,37277371,,,,,,,,
EYQALAHCFGQNPELK,so,C,450,true,"Arabidopsis S-sulfenylation chemoproteomics",108,31578252,"pFind PSM Score",0.0121000,,,,,,-0.8565741
EYQALAHCFGQNPELK,so,C,450,true,"S-sulfenylation site detection using YAP1C",110,32714340,,,,,,,,
