Peptide,PTM,ModifiedAA,ModifiedPosition,PeptideUniqueToGene,ExperimentDesc,ExpID,PubmedID,ScoreType,IdentScore,LocProb,Log2FChange,PQ-val,QuantSig,PEP,MassErrorPPM
KLSEMLVPR,ph,S,15,true,"atm and atr DNA damage response",88,25561503,"MASCOT Score",40.0000000,1.0000000,,,,,-0.1100000
KLSEMLVPR,ph,S,15,true,"Tissue atlas Arabidopsis - ProteomicsDB",114,32188942,"MaxQuant score",60.4900000,1.0000000,,,,0.01170920021832,
SRSAAIKPEEYTASPR,ph,S,24,true,"TOR Kinase and ABA Receptor",100,29290610,XCorr,2.7925005,0.8743000,,,,5.592000161414E-5,
SAAIKPEEYTASPR,ph,S,35,true,"Tissue atlas Arabidopsis - ProteomicsDB",114,32188942,"MaxQuant score",92.8970000,0.9450560,,,,5.1224498747615E-5,
SPLDLNFPSPVHSK,ph,S,46,true,"Tissue atlas Arabidopsis - ProteomicsDB",114,32188942,"MaxQuant score",224.6700000,0.9999890,,,,0,
SPLDLNFPSPVHSK,ph,S,50,true,"Tissue atlas Arabidopsis - ProteomicsDB",114,32188942,"MaxQuant score",43.2080000,0.9695770,,,,0.0085974698886275,
HDPVRYSGR,ph,S,82,true,"Tissue atlas Arabidopsis - ProteomicsDB",114,32188942,"MaxQuant score",63.6110000,0.9997260,,,,0.00472750980407,
QSVRGPTEFLSSCCLCKK,ub,K,158,true,"Arabidopsis ubiquitination by TUBEs",2,23667124,,,,,,,,
NADVLSSPYAAGQR,ph,S,207,true,"Tissue atlas Arabidopsis - ProteomicsDB",114,32188942,"MaxQuant score",130.6600000,0.9969480,,,,3.5458000638755E-5,
