Peptide,PTM,ModifiedAA,ModifiedPosition,PeptideUniqueToGene,ExperimentDesc,ExpID,PubmedID,ScoreType,IdentScore,LocProb,Log2FChange,PQ-val,QuantSig,PEP,MassErrorPPM
KCVSLNNLSDYEQTAETPK,ph,S,41,true,"Tissue atlas Arabidopsis - ProteomicsDB",114,32188942,"MaxQuant score",345.3300000,1.0000000,,,,0,
CVSLNNLSDYEQTAETPK,ph,S,41,true,"Large-scale phosphorylation discovery",44,23111157,XCorr,5.7570000,,,,,,
CVSLNNLSDYEQTAETPK,ph,S,41,true,"srk2dei ABA signaling phopshoproteomics",83,23572148,"MASCOT Score",93.0000000,,,,,,-0.0003000
CVSLNNLSDYEQTAETPK,ph,S,41,true,"SnRK2 protein kinase substrates",85,23776212,XCorr,4.4821820,1.0000000,,,,0.0068465401418507,
CVSLNNLSDYEQTAETPK,ph,S,41,true,"Lateral root-induction - NAA vs control",106,23328941,"MASCOT Score",43.0000000,,,,,,
CVSLNNLSDYEQTAETPK,ph,S,46,true,"srk2dei ABA signaling phopshoproteomics",83,23572148,"MASCOT Score",42.0000000,,,,,,0.0016000
TPAGYASADEALPMSSSNGK,ph,S,76,true,"SnRK2 protein kinase substrates",85,23776212,XCorr,4.0206556,1.0000000,,,,2.4081199256898E-8,
TPAGYASADEALPMSSSNGK,ph,S,76,true,"atm and atr DNA damage response",88,25561503,"MASCOT Score",48.0000000,1.0000000,,,,,-0.1400000
TPAGYASADEALPMSSSNGK,ph,S,76,true,"TOR Kinase and ABA Receptor",100,29290610,XCorr,4.8644538,0.9995000,,,,3.345000010313E-8,
TPAGYASADEALPMSSSNGK,ph,S,76,true,"Tissue atlas Arabidopsis - ProteomicsDB",114,32188942,"MaxQuant score",342.9800000,1.0000000,,,,0,
