Peptide,PTM,ModifiedAA,ModifiedPosition,PeptideUniqueToGene,ExperimentDesc,ExpID,PubmedID,ScoreType,IdentScore,LocProb,Log2FChange,PQ-val,QuantSig,PEP,MassErrorPPM
VVSGKEVLVTSK,ph,S,31,true,"Tissue atlas Arabidopsis - ProteomicsDB",114,32188942,"MaxQuant score",145.3900000,1.0000000,,,,2.3477900867874E-6,
SGGMLETQNVGPEEISDDEIELPEGK,ph,S,64,true,"Lateral root-induction - NAA vs control",106,23328941,"MASCOT Score",20.0000000,,,,,,
SGGMLETQNVGPEEISDDEIELPEGK,ph,S,79,true,"Arabidopsis root NAA phosphoproteome",18a,27643528,"MaxQuant Score",78.6420000,1.0000000,,,,2.1880000034002E-8,1.5070000
SGGMLETQNVGPEEISDDEIELPEGK,ph,S,79,true,"Sucrose-induced phosphorylation",24,17586839,,,,,,,,
SGGMLETQNVGPEEISDDEIELPEGK,ph,S,79,true,"Ph protein kinases and peptide chip analysis",27,18433157,,,,,,,,
SGGMLETQNVGPEEISDDEIELPEGK,ph,S,79,true,"Large-scale phosphorylation discovery",44,23111157,XCorr,4.2280000,,,,,,
SGGMLETQNVGPEEISDDEIELPEGK,ph,S,79,true,"Chloroplast kinase substrates",60,19376835,"MASCOT Score",87.0800000,,,,,,-1.0253100
SGGMLETQNVGPEEISDDEIELPEGK,ph,S,79,true,"srk2dei ABA signaling phopshoproteomics",83,23572148,"MASCOT Score",92.0000000,,,,,,-0.0064000
SGGMLETQNVGPEEISDDEIELPEGK,ph,S,79,true,"LAXIC - ABA stress",84a,23660473,XCorr,4.9500000,1.0000000,,,,0.0087848901748657,
SGGMLETQNVGPEEISDDEIELPEGK,ph,S,79,true,"SnRK2 protein kinase substrates",85,23776212,XCorr,3.6333866,1.0000000,,,,6.3667102949694E-5,
SGGMLETQNVGPEEISDDEIELPEGK,ph,S,79,true,"TOR Kinase and ABA Receptor",100,29290610,XCorr,4.8432202,1.0000000,,,,0.0003382999857422,
SGGMLETQNVGPEEISDDEIELPEGK,ph,S,79,true,"Lateral root-induction - NAA vs control",106,23328941,"MASCOT Score",40.0000000,,,,,,
SGGMLETQNVGPEEISDDEIELPEGK,ph,S,79,true,"Phospho cell culture sucrose/TOR",109,30833711,,,0.9973060,,,,,
SGGMLETQNVGPEEISDDEIELPEGK,ph,S,79,true,"Col-0 callus - FC Col-0 vs. Col-0 Xray",111a,31410901,,37.8800000,,0.9863324,0.0000000,NO,,1.0953796
SGGMLETQNVGPEEISDDEIELPEGK,ph,S,79,true,"Col-0 X-ray callus - FC Col-0 vs. Col-0 Xray",111b,31410901,,37.8800000,,0.9863324,0.0000000,NO,,1.0953796
SGGMLETQNVGPEEISDDEIELPEGK,ph,S,79,true,"atm callus - FC atm vs. atm Xray",111c,31410901,,37.8800000,,1.5664393,0.0000000,NO,,1.0953796
SGGMLETQNVGPEEISDDEIELPEGK,ph,S,79,true,"atm-3 X-ray callus - FC atm vs. atm Xray",111d,31410901,,37.8800000,,1.5664393,0.0000000,NO,,1.0953796
SGGMLETQNVGPEEISDDEIELPEGK,ph,S,79,true,"Touch-induced phosphorylation: 40s touch vs untouc",136,30291188,"MASCOT score",100.5300000,,0.4892857,0.5795138,NO,,1.3743457
STDSQNVAPVQDHSLSDAER,ph,S,90,true,"atm and atr DNA damage response",88,25561503,"MASCOT Score",41.0000000,0.9950000,,,,,-0.2700000
STDSQNVAPVQDHSLSDAER,ph,S,90,true,"TOR Kinase and ABA Receptor",100,29290610,XCorr,2.5759890,0.8700000,,,,0.0037060000468045,
STDSQNVAPVQDHSLSDAER,ph,S,90,true,"Tissue atlas Arabidopsis - ProteomicsDB",114,32188942,"MaxQuant score",245.9200000,0.9866630,,,,0,
STDSQNVAPVQDHSLSDAER,ph,T,91,true,"Tissue atlas Arabidopsis - ProteomicsDB",114,32188942,"MaxQuant score",196.4000000,0.8348960,,,,0,
STDSQNVAPVQDHSLSDAER,ph,S,93,true,"atm and atr DNA damage response",88,25561503,"MASCOT Score",41.0000000,0.9340000,,,,,-0.2700000
STDSQNVAPVQDHSLSDAER,ph,S,93,true,"TOR Kinase and ABA Receptor",100,29290610,XCorr,2.5759890,0.9786000,,,,0.0037060000468045,
STDSQNVAPVQDHSLSDAER,ph,S,93,true,"Tissue atlas Arabidopsis - ProteomicsDB",114,32188942,"MaxQuant score",245.9200000,0.9999980,,,,0,
STDSQNVAPVQDHSLSDAER,ph,S,103,true,"Tissue atlas Arabidopsis - ProteomicsDB",114,32188942,"MaxQuant score",184.5900000,0.8455400,,,,3.6433760072445E-44,
STDSQNVAPVQDHSLSDAER,ph,S,105,true,"atm and atr DNA damage response",88,25561503,"MASCOT Score",65.0000000,0.9380000,,,,,-0.8300000
STDSQNVAPVQDHSLSDAER,ph,S,105,true,"TOR Kinase and ABA Receptor",100,29290610,XCorr,4.3290768,0.9004000,,,,1.0619999557093E-5,
STDSQNVAPVQDHSLSDAER,ph,S,105,true,"Tissue atlas Arabidopsis - ProteomicsDB",114,32188942,"MaxQuant score",338.0300000,0.9985070,,,,0,
LLVEAESAKPK,ph,S,279,true,"atm and atr DNA damage response",88,25561503,"MASCOT Score",44.0000000,1.0000000,,,,,-1.7700000
LLVEAESAKPK,ph,S,279,true,"Tissue atlas Arabidopsis - ProteomicsDB",114,32188942,"MaxQuant score",142.7700000,1.0000000,,,,9.3104603138272E-8,
KVSSQSIEPPAVEDPQIELEK,ph,S,317,true,"SnRK2 protein kinase substrates",85,23776212,XCorr,4.1889849,0.8530000,,,,7.8021198390843E-9,
KVSSQSIEPPAVEDPQIELEK,ph,S,317,true,"Tissue atlas Arabidopsis - ProteomicsDB",114,32188942,"MaxQuant score",273.9800000,0.9481160,,,,0,
VSSQSIEPPAVEDPQIELEK,ph,S,317,true,"srk2dei ABA signaling phopshoproteomics",83,23572148,"MASCOT Score",67.0000000,,,,,,-0.0005000
VSSQSIEPPAVEDPQIELEK,ph,S,319,true,"srk2dei ABA signaling phopshoproteomics",83,23572148,"MASCOT Score",41.0000000,,,,,,0.0007000
VHNPVVESSIQPQRSPRK,ph,S,349,true,"srk2dei ABA signaling phopshoproteomics",83,23572148,"MASCOT Score",25.0000000,,,,,,0.0011000
KVHNPVVESSIQPQRSPR,ph,S,349,true,"Tissue atlas Arabidopsis - ProteomicsDB",114,32188942,"MaxQuant score",74.6980000,0.9901750,,,,0.00012038300337736,
VHNPVVESSIQPQRSPR,ph,S,349,true,"atm and atr DNA damage response",88,25561503,"MASCOT Score",46.0000000,0.8670000,,,,,-0.5700000
VHNPVVESSIQPQRSPRK,ph,S,350,true,"srk2dei ABA signaling phopshoproteomics",83,23572148,"MASCOT Score",29.0000000,,,,,,-0.0016000
VHNPVVESSIQPQRSPRK,ph,S,350,true,"TOR Kinase and ABA Receptor",100,29290610,XCorr,3.3081174,0.9702000,,,,0.00065499998163432,
VHNPVVESSIQPQRSPRK,ph,S,356,true,"srk2dei ABA signaling phopshoproteomics",83,23572148,"MASCOT Score",42.0000000,,,,,,-0.0002000
KVHNPVVESSIQPQRSPR,ph,S,356,true,"atm and atr DNA damage response",88,25561503,"MASCOT Score",46.0000000,1.0000000,,,,,-0.1600000
KVHNPVVESSIQPQRSPR,ph,S,356,true,"Tissue atlas Arabidopsis - ProteomicsDB",114,32188942,"MaxQuant score",191.4000000,1.0000000,,,,1.4012984643248E-45,
VHNPVVESSIQPQRSPR,ph,S,356,true,"Phosphorylation Early Elicitor Signaling",23,17317660,,,,,,,,
VHNPVVESSIQPQRSPR,ph,S,356,true,"MAPK Arabidopsis substrates",45,23172892,"MaxQuant Score",63.7090000,,,,,,
VHNPVVESSIQPQRSPR,ph,S,356,true,"PAMP-triggered phosphorylation",48,24601666,"MASCOT Score",24.3600000,,,,,,
VHNPVVESSIQPQRSPR,ph,S,356,true,"srk2dei ABA signaling phopshoproteomics",83,23572148,"MASCOT Score",44.0000000,,,,,,-0.0010000
VHNPVVESSIQPQRSPR,ph,S,356,true,"LAXIC - mannitol vs control",84b,23660473,XCorr,2.0400000,0.9980000,,,,0.0091843903064728,
VHNPVVESSIQPQRSPR,ph,S,356,true,"SnRK2 protein kinase substrates",85,23776212,XCorr,2.5557520,1.0000000,,,,0.00084137602243572,
VHNPVVESSIQPQRSPR,ph,S,356,true,"atm and atr DNA damage response",88,25561503,"MASCOT Score",54.0000000,0.8760000,,,,,-1.3600000
VHNPVVESSIQPQRSPR,ph,S,356,true,"TOR Kinase and ABA Receptor",100,29290610,XCorr,3.1082726,1.0000000,,,,0.00017109999316745,
VHNPVVESSIQPQRSPR,ph,S,356,true,"Phospho cell culture sucrose/TOR",109,30833711,,,0.9997200,,,,,
ENSAGKENQK,ph,S,465,false,"atm and atr DNA damage response",88,25561503,"MASCOT Score",37.0000000,1.0000000,,,,,-1.5700000
RHSLPSPGNGR,ph,S,536,true,"atm and atr DNA damage response",88,25561503,"MASCOT Score",43.0000000,1.0000000,,,,,0.3600000
RHSLPSPGNGR,ph,S,536,true,"Tissue atlas Arabidopsis - ProteomicsDB",114,32188942,"MaxQuant score",55.9800000,0.9874960,,,,0.0035649801138788,
HSLPSPGNGR,ph,S,539,true,"atm and atr DNA damage response",88,25561503,"MASCOT Score",40.0000000,1.0000000,,,,,-0.9400000
HSLPSPGNGR,ph,S,539,true,"Tissue atlas Arabidopsis - ProteomicsDB",114,32188942,"MaxQuant score",90.9130000,0.9999530,,,,0.0011650000233203,
EGNAKTTPAER,ub,K,579,true,"Arabidopsis ubiquitination COFRADIC",40,26744219,"MaxQuant Score",64.6400000,1.0000000,,,,0.0040000001899898,0.0840000
