Peptide,PTM,ModifiedAA,ModifiedPosition,PeptideUniqueToGene,ExperimentDesc,ExpID,PubmedID,ScoreType,IdentScore,LocProb,Log2FChange,PQ-val,QuantSig,PEP,MassErrorPPM
KLPSQSPPPDDIPASSSLIK,ph,S,77,true,"Tissue atlas Arabidopsis - ProteomicsDB",114,32188942,"MaxQuant score",109.8300000,0.9954370,,,,9.6241200772673E-12,
KVESASGDTNFQALK,ph,S,154,true,"Tissue atlas Arabidopsis - ProteomicsDB",114,32188942,"MaxQuant score",115.7300000,0.9969650,,,,3.2599900805508E-6,
AIDLVDEACANVR,so,C,399,true,"Arabidopsis S-sulfenylation chemoproteomics",108,31578252,"pFind PSM Score",0.0009006,,,,,,-1.7849121
VESGGLVDASTGK,ph,S,868,true,"Tissue atlas Arabidopsis - ProteomicsDB",114,32188942,"MaxQuant score",123.6300000,0.8728860,,,,2.1692199879908E-5,
SDVLIHIANGPK,ph,S,873,true,"Tissue atlas Arabidopsis - ProteomicsDB",114,32188942,"MaxQuant score",109.1600000,1.0000000,,,,7.0234098529909E-5,
SDVLIHIANGPKRSDAAQAVK,ph,S,886,true,"Tissue atlas Arabidopsis - ProteomicsDB",114,32188942,"MaxQuant score",92.8330000,1.0000000,,,,6.1009600926809E-8,
RSDAAQAVKK,ac,K,893,true,"Quantitative Acetylproteomics",101,29440448,,,,,,,,
SDAAQAVKK,ac,K,893,true,"Quantitative Acetylproteomics",101,29440448,,,,,,,,
