Peptide,PTM,ModifiedAA,ModifiedPosition,PeptideUniqueToGene,ExperimentDesc,ExpID,PubmedID,ScoreType,IdentScore,LocProb,Log2FChange,PQ-val,QuantSig,PEP,MassErrorPPM
SAQPNKPKAAVSTGSFVTADE,nt,S,55,true,"HUNTER N-terminome: legumain, GluC and trypsin",119,31951383,"MaxQuant score",65.0220000,,,,,,
AAVSTGSFVTADELPSLVEKPAAEVIHFYR,nt,A,63,true,"Arg/N-end rule pathway Roots",80,25728785,"MASCOT Score",41.7600000,,,,,7.8689996740877E-9,
AAVSTGSFVTADELPSLVEKPAAEVIHFYR,nt,A,63,true,"Stromal N-terminome",96,26371235,"MASCOT Score",52.7300000,,,,,,
AAVSTGSFVTADELPSLVEKPAAEVIHFYR,nt,A,63,true,"HUNTER N-terminome: legumain, GluC and trypsin",119,31951383,"MaxQuant score",98.6710000,,,,,,
AAVSTGSFVTADELPSLVEKPAAEVIHFYR,nt,A,63,true,"Mitochondrial intermediate peptidases - icp55 / WT",131a,25732537,,77.0300000,,0.3849035,,,,
AAVSTGSFVTADELPSLVEKPAAEVIHFYR,nt,A,63,true,"Mitochondrial intermediate peptidases - oct1-1 / WT",131b,25732537,,92.0800000,,-0.0031141,,,,
AAVSTGSFVTADELPSLVEKPAAEVIHFYR,nt,A,63,true,"Arabidopsis translation initiation landscape - NT",167b,35069635,,,,,,,,
AAVSTGSFVTADELPSLVEKPAAE,nt,A,63,true,"N-terminal ChaFRADIC",92,26010716,"MASCOT Score",36.7500000,,,,,0.0011559999547899,
AAVSTGSFVTADE,nt,A,63,true,"Arg/N-end rule seed, prt6 vs. Wt",99,29168982,"MASCOT Score",84.6700000,,0.8606722,0.2119621,NO,1.1910000239368E-6,-1.7984987
AAVSTGSFVTADE,nt,A,63,true,"HUNTER N-terminome: legumain, GluC and trypsin",119,31951383,"MaxQuant score",126.4100000,,,,,,
AAVSTGSFVTAD,nt,A,63,true,"HUNTER N-terminome: legumain, GluC and trypsin",119,31951383,"MaxQuant score",103.8300000,,,,,,
AAVSTGSFVTADELPSLVEKPAAEVIHFYR,nta,A,63,true,"Arabidopsis translation initiation landscape - NTA",167a,35069635,,,,,,,,
AAVSTGSFVTADELPSLVEKPAAE,nta,A,63,true,"N-terminal ChaFRADIC",92,26010716,"MASCOT Score",36.7500000,,,,,0.0011559999547899,
AVSTGSFVTADELPSLVEKPAAEVIHFYR,nt,A,64,true,"HUNTER N-terminome: legumain, GluC and trypsin",119,31951383,"MaxQuant score",63.3610000,,,,,,
AVSTGSFVTADELPSLVEKPAAEVIHFYR,nt,A,64,true,"Arabidopsis translation initiation landscape - NT",167b,35069635,,,,,,,,
AVSTGSFVTADELPSLVEKPAAE,nt,A,64,true,"N-terminal ChaFRADIC",92,26010716,"MASCOT Score",65.3800000,,,,,1.1219999862533E-7,
AVSTGSFVTADELPSLVEKPAAE,nt,A,64,true,"HUNTER N-terminome: legumain, GluC and trypsin",119,31951383,"MaxQuant score",85.1630000,,,,,,
AVSTGSFVTADE,nt,A,64,true,"Arg/N-end rule seed, prt6 vs. Wt",99,29168982,"MASCOT Score",69.7400000,,0.2906521,0.2268912,NO,1.0310000106983E-5,-2.3134587
AVSTGSFVTADELPSLVEKPAAE,nta,A,64,true,"N-terminal ChaFRADIC",92,26010716,"MASCOT Score",24.2500000,,,,,0.00068210001336411,
AVSTGSFVTADELPSLVEKPAAE,nta,A,64,true,"HUNTER N-terminome: legumain, GluC and trypsin",119,31951383,"MaxQuant score",,,,,,,
VIHFYRVPLIQE,nt,V,87,true,"Arabidopsis translation initiation landscape - NT",167b,35069635,,,,,,,,
ACGLDEVTR,ox,C,196,true,"OxiTRAQ Arabidopsis - 5 mM H2O2 versus control",47,24376095,,,,-0.2510401,0.0244872,NO,,
ACGLDEVTR,ox,C,196,true,"OxiTRAQ SA and flg22 responses - SA vs mock",91a,25720653,"MASCOT Score",45.9600000,,-0.1046974,0.1240000,NO,,
ACGLDEVTR,ox,C,196,true,"OxiTRAQ SA and flg22 responses - flg22 vs mock",91b,25720653,"MASCOT Score",45.9600000,,0.5849625,0.0120000,YES,,
ACGLDEVTR,sno,C,196,true,"hot5-4 / wildtype, FAT-switch S-nitrosoproteome",169,37277371,,,,0.0580076,0.8690147,NO,,
ACGLDEVTR,so,C,196,true,"S-sulfenylation site detection using YAP1C",110,32714340,,,,,,,,
MTECVYTQK,ox,C,237,true,"OxiTRAQ Arabidopsis - 5 mM H2O2 versus control",47,24376095,,,,0.1911395,0.0105598,YES,,
MTECVYTQK,sno,C,237,true,"Site-specific nitrosomeproteomic id - gsnor1-3",90a,25699590,XCorr,2.4431128,,,,,0.00081619998672977,-6.6382886
MTECVYTQK,sno,C,237,true,"Site-specific nitrosomeproteomic id - gsnor1-3",90b,25699590,XCorr,2.2600000,,,,,0.1203999966383,-7.0300000
YVPVMEKGR,ac,K,263,true,"Quantitative Acetylproteomics",101,29440448,,,,,,,,
ACIEMGEK,so,C,586,true,"S-sulfenylation site detection using YAP1C",110,32714340,,,,,,,,
NPIISIHDQGAGGNCNVVK,sno,C,607,true,"Site-specific nitrosomeproteomic id - gsnor1-3",90a,25699590,XCorr,3.9600000,,,,,2.7060000320489E-6,-4.4200000
NPIISIHDQGAGGNCNVVK,so,C,607,true,"Arabidopsis S-sulfenylation chemoproteomics",108,31578252,"pFind PSM Score",0.0000292,,1.3228600,,,,-0.9601209
EILQSICK,ox,C,663,true,"OxiTRAQ Arabidopsis - 5 mM H2O2 versus control",47,24376095,,,,-0.2232146,0.0095643,NO,,
CTLIDSTAAAK,ox,C,682,true,"OxiTRAQ Arabidopsis - 5 mM H2O2 versus control",47,24376095,,,,0.0581976,0.0076950,NO,,
CTLIDSTAAAK,sno,C,682,true,"hot5-4 / wildtype, FAT-switch S-nitrosoproteome",169,37277371,,,,-0.0887314,0.6306462,NO,,
CTLIDSTAAAK,so,C,682,true,"S-sulfenylation site detection using YAP1C",110,32714340,,,,,,,,
APGNLVISAYVTCPDITK,so,C,911,true,"S-sulfenylation site detection using YAP1C",110,32714340,,,,,,,,
TNLDAVMEKLR,ac,K,1047,true,"Quantitative Acetylproteomics",101,29440448,,,,,,,,
LASCVEMEK,ph,S,1103,true,"Tissue atlas Arabidopsis - ProteomicsDB",114,32188942,"MaxQuant score",51.7270000,1.0000000,,,,0.015919599682093,
LASCVEMEKEGLK,so,C,1104,true,"S-sulfenylation site detection using YAP1C",110,32714340,,,,,,,,
