Peptide,PTM,ModifiedAA,ModifiedPosition,PeptideUniqueToGene,ExperimentDesc,ExpID,PubmedID,ScoreType,IdentScore,LocProb,Log2FChange,PQ-val,QuantSig,PEP,MassErrorPPM
ANFQESPTSDPEMTEGNGFSHLGLDLR,ph,S,129,true,"Tissue atlas Arabidopsis - ProteomicsDB",114,32188942,"MaxQuant score",150.9800000,0.7872030,,,,0,
REDSPRPYGLK,ph,S,181,false,"Tissue atlas Arabidopsis - ProteomicsDB",114,32188942,"MaxQuant score",74.7890000,0.9999980,,,,0.00066568399779499,
ELPRLSLDSR,ph,S,244,false,"Tissue atlas Arabidopsis - ProteomicsDB",114,32188942,"MaxQuant score",91.3070000,0.9999940,,,,0.00088592298561707,
LMGLETLPGSPLGR,ph,S,296,true,"Tissue atlas Arabidopsis - ProteomicsDB",114,32188942,"MaxQuant score",178.1400000,0.9999920,,,,4.572039960346E-23,
SLGKDPASPR,ph,S,349,true,"Tissue atlas Arabidopsis - ProteomicsDB",114,32188942,"MaxQuant score",92.2650000,1.0000000,,,,0.00025350900250487,
SRPPTPPDSSK,ph,T,606,true,"Tissue atlas Arabidopsis - ProteomicsDB",114,32188942,"MaxQuant score",76.9390000,0.9813420,,,,0.0087477900087833,
KPSNQQLVESTSPGGR,ph,S,626,true,"Tissue atlas Arabidopsis - ProteomicsDB",114,32188942,"MaxQuant score",126.0700000,0.9036530,,,,8.2663497380508E-8,
STEADGGKSPSVIEAAK,ph,S,683,true,"Tissue atlas Arabidopsis - ProteomicsDB",114,32188942,"MaxQuant score",199.7500000,0.9533170,,,,2.117824408088E-40,
RLNSSHDEASQDYIASLCENADPTTDHR,ph,S,798,true,"Tissue atlas Arabidopsis - ProteomicsDB",114,32188942,"MaxQuant score",170.8600000,0.7802060,,,,0,
MKSYAKVTKKAVSAQQL,nta,M,915,true,"Arabidopsis translation initiation landscape - NTA",167a,35069635,,,,,,,,
