Peptide,PTM,ModifiedAA,ModifiedPosition,PeptideUniqueToGene,ExperimentDesc,ExpID,PubmedID,ScoreType,IdentScore,LocProb,Log2FChange,PQ-val,QuantSig,PEP,MassErrorPPM
DTIANPNLTNCENR,nt,D,75,true,"Arg/N-end rule seed, prt6 vs. Wt",99,29168982,"MASCOT Score",74.0800000,,-0.3262420,0.2190413,NO,0.0017529999604449,-1.5456317
DTIANPNLTNCENR,nt,D,75,true,"FtsH12 N-terminome: WT / FtsH12 knockdown miRNA",118,33216923,"MaxQuant score",95.4170000,,1.1297399,0.0080839,YES,0.00073048000922427,
DTIANPNLTNCENR,nt,D,75,true,"HUNTER N-terminome: legumain, GluC and trypsin",119,31951383,"MaxQuant score",184.3100000,,,,,,
DTIANPNLTNCE,nt,D,75,true,"N-terminal ChaFRADIC",92,26010716,"MASCOT Score",78.8600000,,,,,5.1900001381E-6,
DTIANPNLTNCE,nt,D,75,true,"HUNTER N-terminome: legumain, GluC and trypsin",119,31951383,"MaxQuant score",218.6000000,,,,,,
FSSIVSGKAGITYR,ph,T,135,true,"Phosphorylation in N starvation",63,22060019,"MASCOT Score",24.0000000,,,,,,6.4856700
GEICNVNK,sno,C,187,true,"hot5-4 / wildtype, FAT-switch S-nitrosoproteome",169,37277371,,,,-0.5732048,0.0009238,NO,,
VLEGMGVVEKMR,ac,K,263,true,"Quantitative Acetylproteomics",101,29440448,,,,,,,,
