Peptide,PTM,ModifiedAA,ModifiedPosition,PeptideUniqueToGene,ExperimentDesc,ExpID,PubmedID,ScoreType,IdentScore,LocProb,Log2FChange,PQ-val,QuantSig,PEP,MassErrorPPM
SVVAKECRVKGVKARQII,nt,S,43,true,"Arabidopsis translation initiation landscape - NT",167b,35069635,,,,,,,,
SVVAKECR,nt,S,43,true,"N-terminal ChaFRADIC",92,26010716,"MASCOT Score",23.6300000,,,,,0.00091359997168183,
VVAKECRVKGVKARQII,nt,V,44,true,"Arabidopsis translation initiation landscape - NT",167b,35069635,,,,,,,,
GASTGIYE,nt,G,85,false,"Arg/N-end rule seed, prt6 vs. Wt",99,29168982,"MASCOT Score",29.6600000,,,,,0.025240000337362,5.1443897
TGIYEALELR,nt,T,88,false,"Arg/N-end rule pathway Roots",80,25728785,"MASCOT Score",25.0000000,,,,,0.068499997258186,
NQADVDALMLELDGTPNKSK,ph,S,149,true,"Tissue atlas Arabidopsis - ProteomicsDB",114,32188942,"MaxQuant score",181.7700000,0.9387260,,,,5.7453237037317E-44,
YGQDACNVGDEGGFAPNVQDNR,so,C,250,true,"S-sulfenylation site detection using YAP1C",110,32714340,,,,,,,,
NVGDEGGFAPNVQDNR,nt,N,251,true,"Arg/N-end rule seed, prt6 vs. Wt",99,29168982,"MASCOT Score",85.6900000,,-0.7824879,0.1150096,NO,0.00012160000187578,-1.4937159
VGDEGGFAPNVQDNR,nt,V,252,true,"Arg/N-end rule seed, prt6 vs. Wt",99,29168982,"MASCOT Score",31.5300000,,-0.9817071,0.2444073,NO,0.12349999696016,-1.7449737
KQPNDGAHVLSAESLADLYR,ph,S,319,true,"Tissue atlas Arabidopsis - ProteomicsDB",114,32188942,"MaxQuant score",82.6000000,0.9985660,,,,2.6875300136453E-6,
SCNALLLK,acy,C,384,false,"Arabidopsis S-acylation atlas - Meristem",163a,35681017,,,,,,,,
SCNALLLK,acy,C,384,false,"Arabidopsis S-acylation atlas - Hypocotyl",163b,35681017,,,,,,,,
SCNALLLK,acy,C,384,false,"Arabidopsis S-acylation atlas - Stem",163f,35681017,,,,,,,,
SCNALLLK,cn,C,384,false,"Cellular regulation by S-cyanylation",115,30377236,,,,,,,,
SCNALLLK,ox,C,384,false,"OxiTRAQ Arabidopsis - 5 mM H2O2 versus control",47,24376095,,,,0.0183924,0.4814494,NO,,
SCNALLLK,sno,C,384,false,"hot5-4 / wildtype, FAT-switch S-nitrosoproteome",169,37277371,,,,,,,,
QSCNALLLK,so,C,384,true,"S-sulfenylation site detection using YAP1C",110,32714340,,,,,,,,
SCNALLLK,so,C,384,false,"S-sulfenylation site detection using YAP1C",110,32714340,,,,,,,,
VNQIGTVTE,nt,V,391,false,"Arg/N-end rule seed, prt6 vs. Wt",99,29168982,"MASCOT Score",43.0900000,,-0.1418989,0.5206920,NO,0.011549999937415,-3.1624399
SGETEDNFIADLSVGLASGQIKTGAPCR,nt,S,420,true,"Metacaspase9 substrates - 35S:MC9 / mc9",51b,23964026,"MASCOT Score",44.0000000,,1.0447840,,NO,,-1.8417972
SGETEDNFIADLSVGLASGQIKTGAPCR,nt,S,420,true,"Arabidopsis translation initiation landscape - NT",167b,35069635,,,,,,,,
SGETEDNFIA,nt,S,420,true,"N-terminal ChaFRADIC",92,26010716,"MASCOT Score",72.4300000,,,,,1.0130000191566E-5,
TGAPCR,sno,C,446,false,"hot5-4 / wildtype, FAT-switch S-nitrosoproteome",169,37277371,,,,,,,,
TGAPCRSER,so,C,446,false,"S-sulfenylation site detection using YAP1C",110,32714340,,,,,,,,
TGAPCR,so,C,446,false,"Arabidopsis S-sulfenylation chemoproteomics",108,31578252,"pFind PSM Score",0.2974840,,,,,,1.2812745
YAGEAFRSP,ph,S,476,true,"srk2dei ABA signaling phopshoproteomics",83,23572148,"MASCOT Score",51.0000000,,,,,,0.0003000
YAGEAFRSP,ph,S,476,true,"atm and atr DNA damage response",88,25561503,"MASCOT Score",32.0000000,1.0000000,,,,,-0.6400000
YAGEAFRSP,ph,S,476,true,"TOR Kinase and ABA Receptor",100,29290610,XCorr,3.4181688,1.0000000,,,,0.00066289998358116,
YAGEAFRSP,ph,S,476,true,"Phospho cell culture sucrose/TOR",109,30833711,,,1.0000000,,,,,
YAGEAFRSP,ph,S,476,true,"Col-0 callus - FC Col-0 vs. Col-0 Xray",111a,31410901,,47.3300000,,0.8453599,0.0000000,NO,,-0.0198718
YAGEAFRSP,ph,S,476,true,"Col-0 X-ray callus - FC Col-0 vs. Col-0 Xray",111b,31410901,,47.3300000,,0.8453599,0.0000000,NO,,-0.0198718
YAGEAFRSP,ph,S,476,true,"atm callus - FC atm vs. atm Xray",111c,31410901,,47.3300000,,0.9985236,0.0000000,NO,,-0.0198718
YAGEAFRSP,ph,S,476,true,"atm-3 X-ray callus - FC atm vs. atm Xray",111d,31410901,,47.3300000,,0.9985236,0.0000000,NO,,-0.0198718
YAGEAFRSP,ph,S,476,true,"Tissue atlas Arabidopsis - ProteomicsDB",114,32188942,"MaxQuant score",137.5500000,1.0000000,,,,0.00017649499932304,
