Peptide,PTM,ModifiedAA,ModifiedPosition,PeptideUniqueToGene,ExperimentDesc,ExpID,PubmedID,ScoreType,IdentScore,LocProb,Log2FChange,PQ-val,QuantSig,PEP,MassErrorPPM
DLSEQLDSVTLENGSQSSGEAK,ph,S,149,true,"atm and atr DNA damage response",88,25561503,"MASCOT Score",74.0000000,1.0000000,,,,,0.8800000
LSVIGATSDSESR,ph,S,553,true,"Tissue atlas Arabidopsis - ProteomicsDB",114,32188942,"MaxQuant score",152.1100000,0.9336950,,,,2.9583299010483E-7,
MESQNQPSHENPIVHEIPSDVEGPTEELAHR,ph,S,1101,true,"TOR Kinase and ABA Receptor",100,29290610,XCorr,5.2136459,0.9998000,,,,6.9809997512493E-5,
MESQNQPSHENPIVHEIPSDVEGPTEELAHR,ph,S,1101,true,"Phospho cell culture sucrose/TOR",109,30833711,,,0.9356010,,,,,
MESQNQPSHENPIVHEIPSDVEGPTEELAHR,ph,S,1101,true,"Tissue atlas Arabidopsis - ProteomicsDB",114,32188942,"MaxQuant score",347.5100000,1.0000000,,,,0,
EANPPTKEPQKEPDVVSVSVSHEVK,ph,S,1134,true,"Tissue atlas Arabidopsis - ProteomicsDB",114,32188942,"MaxQuant score",125.3500000,0.9083210,,,,8.2712595543158E-28,
VRPSGATSR,ph,S,1153,true,"atm and atr DNA damage response",88,25561503,"MASCOT Score",31.0000000,0.8760000,,,,,-0.3100000
AEGSARTIER,ph,S,1158,true,"atm and atr DNA damage response",88,25561503,"MASCOT Score",30.0000000,1.0000000,,,,,0.3800000
TIERSQGIVVR,ph,T,1161,true,"atm and atr DNA damage response",88,25561503,"MASCOT Score",20.0000000,1.0000000,,,,,-0.5600000
TIERSQGIVVR,ph,T,1161,true,"Tissue atlas Arabidopsis - ProteomicsDB",114,32188942,"MaxQuant score",102.6300000,1.0000000,,,,0.0083413003012538,
AEGSARTIER,ph,T,1161,true,"atm and atr DNA damage response",88,25561503,"MASCOT Score",30.0000000,1.0000000,,,,,0.3800000
TIERSQGIVVR,ph,S,1165,true,"atm and atr DNA damage response",88,25561503,"MASCOT Score",20.0000000,1.0000000,,,,,-0.5600000
TIERSQGIVVR,ph,S,1165,true,"Tissue atlas Arabidopsis - ProteomicsDB",114,32188942,"MaxQuant score",119.7500000,1.0000000,,,,0.0083413003012538,
GQTSSASVDAPQR,ph,S,1180,true,"atm and atr DNA damage response",88,25561503,"MASCOT Score",49.0000000,0.9910000,,,,,0.5100000
GQTSSASVDAPQR,ph,S,1180,true,"Tissue atlas Arabidopsis - ProteomicsDB",114,32188942,"MaxQuant score",95.5380000,0.9912340,,,,0.00073038798291236,
GQTSSASVDAPQR,ph,S,1181,true,"atm and atr DNA damage response",88,25561503,"MASCOT Score",58.0000000,0.9970000,,,,,-0.8500000
GQTSSASVDAPQR,ph,S,1181,true,"Tissue atlas Arabidopsis - ProteomicsDB",114,32188942,"MaxQuant score",115.2400000,0.9988120,,,,9.2030597443227E-5,
GQTSSASVDAPQR,ph,S,1183,true,"atm and atr DNA damage response",88,25561503,"MASCOT Score",49.0000000,1.0000000,,,,,0.5100000
GQTSSASVDAPQR,ph,S,1183,true,"Tissue atlas Arabidopsis - ProteomicsDB",114,32188942,"MaxQuant score",105.5800000,0.9999830,,,,0.00013688500621356,
MTASIGSVK,ph,T,1217,true,"atm and atr DNA damage response",88,25561503,"MASCOT Score",41.0000000,1.0000000,,,,,-1.6200000
MTASIGSVK,ph,S,1219,true,"atm and atr DNA damage response",88,25561503,"MASCOT Score",41.0000000,1.0000000,,,,,-1.6200000
MTASIGSVK,ph,S,1219,true,"Tissue atlas Arabidopsis - ProteomicsDB",114,32188942,"MaxQuant score",106.5800000,0.9996140,,,,0.00037307699676603,
MTASIGSVK,ph,S,1222,true,"atm and atr DNA damage response",88,25561503,"MASCOT Score",41.0000000,1.0000000,,,,,-1.6200000
MTASIGSVK,ph,S,1222,true,"Tissue atlas Arabidopsis - ProteomicsDB",114,32188942,"MaxQuant score",96.6040000,0.9999990,,,,0.00043720798566937,
FASEGDIFGK,ph,S,1227,true,"atm and atr DNA damage response",88,25561503,"MASCOT Score",52.0000000,1.0000000,,,,,-0.6600000
FASEGDIFGK,ph,S,1227,true,"Tissue atlas Arabidopsis - ProteomicsDB",114,32188942,"MaxQuant score",166.2900000,1.0000000,,,,2.694160059491E-7,
FASEGDIFGK,ph,S,1227,true,"Touch-induced phosphorylation: 40s touch vs untouc",136,30291188,"MASCOT score",66.4200000,,-0.4075024,0.4978544,NO,,6.2566489
YASLQTLSIGKEK,ph,S,1284,true,"Tissue atlas Arabidopsis - ProteomicsDB",114,32188942,"MaxQuant score",225.3300000,0.9999450,,,,7.8789098765891E-35,
YASLQTLSIGK,ph,S,1284,true,"TOR Kinase and ABA Receptor",100,29290610,XCorr,2.9874697,0.9986000,,,,0.00022119999630377,
