Peptide,PTM,ModifiedAA,ModifiedPosition,PeptideUniqueToGene,ExperimentDesc,ExpID,PubmedID,ScoreType,IdentScore,LocProb,Log2FChange,PQ-val,QuantSig,PEP,MassErrorPPM
DQPGSPYGDSTPR,ph,S,10,true,"Tissue atlas Arabidopsis - ProteomicsDB",114,32188942,"MaxQuant score",109.9900000,0.9999590,,,,0.00013287899491843,
DQPGSPYGDSTPR,ph,T,16,true,"Tissue atlas Arabidopsis - ProteomicsDB",114,32188942,"MaxQuant score",74.8900000,0.8224780,,,,0.0015407999744639,
SPFSPFSPLSGDER,ph,S,44,true,"Tissue atlas Arabidopsis - ProteomicsDB",114,32188942,"MaxQuant score",137.8000000,0.9995670,,,,1.4603700037696E-5,
FQQALASSGQLDPLSPGSMHHGGHK,ph,S,80,true,"Phospho cell culture sucrose/TOR",109,30833711,,,0.8739320,,,,,
FQQALASSGQLDPLSPGSMHHGGHK,ph,S,80,true,"Tissue atlas Arabidopsis - ProteomicsDB",114,32188942,"MaxQuant score",116.4500000,0.9700240,,,,4.5315098647575E-22,
FQQALASSGQLDPLSPGSMHHGGHK,ph,S,83,true,"Tissue atlas Arabidopsis - ProteomicsDB",114,32188942,"MaxQuant score",178.7000000,0.9821560,,,,0,
VDRSEVTGDR,ph,S,754,false,"Tissue atlas Arabidopsis - ProteomicsDB",114,32188942,"MaxQuant score",89.3590000,0.9999460,,,,0.00036021700361744,
SIGHTDDINSDTGEYSSQSR,ph,S,892,true,"Tissue atlas Arabidopsis - ProteomicsDB",114,32188942,"MaxQuant score",320.5100000,0.9999890,,,,0,
SIGHTDDINSDTGEYSSQSR,ph,S,901,true,"Tissue atlas Arabidopsis - ProteomicsDB",114,32188942,"MaxQuant score",198.9800000,0.9997660,,,,0,
SIGHTDDINSDTGEYSSQSR,ph,S,907,true,"Tissue atlas Arabidopsis - ProteomicsDB",114,32188942,"MaxQuant score",114.0100000,0.7987110,,,,5.4458898328391E-12,
YSVTDGESLASSAEAEYDER,ph,S,913,true,"Tissue atlas Arabidopsis - ProteomicsDB",114,32188942,"MaxQuant score",165.6600000,0.9646290,,,,3.3961201647234E-30,
YSVTDGESLASSAEAEYDER,ph,S,922,true,"Tissue atlas Arabidopsis - ProteomicsDB",114,32188942,"MaxQuant score",221.5100000,0.8289800,,,,0,
YSVTDGESLASSAEAEYDER,ph,S,923,true,"Tissue atlas Arabidopsis - ProteomicsDB",114,32188942,"MaxQuant score",197.3800000,0.9586020,,,,0,
SSTSVTRPLDK,ph,S,968,true,"Tissue atlas Arabidopsis - ProteomicsDB",114,32188942,"MaxQuant score",158.2500000,0.7545330,,,,2.7413799008613E-10,
SSTSVTRPLDK,ph,T,970,true,"Tissue atlas Arabidopsis - ProteomicsDB",114,32188942,"MaxQuant score",145.8100000,0.7771400,,,,1.9039299559154E-7,
VTGLTSSSKGLASSSIK,ph,S,1000,true,"Tissue atlas Arabidopsis - ProteomicsDB",114,32188942,"MaxQuant score",131.4800000,0.8872590,,,,1.3002300347509E-9,
GLASSSIKK,ph,S,1006,true,"Tissue atlas Arabidopsis - ProteomicsDB",114,32188942,"MaxQuant score",85.3550000,0.9762520,,,,0.0023605800233781,
GLASSSIKK,ph,S,1007,true,"Tissue atlas Arabidopsis - ProteomicsDB",114,32188942,"MaxQuant score",123.7900000,0.9831400,,,,0.00017353499424644,
