Peptide,PTM,ModifiedAA,ModifiedPosition,PeptideUniqueToGene,ExperimentDesc,ExpID,PubmedID,ScoreType,IdentScore,LocProb,Log2FChange,PQ-val,QuantSig,PEP,MassErrorPPM
QPLETEAEIKEDGK,ph,T,192,true,"Tissue atlas Arabidopsis - ProteomicsDB",114,32188942,"MaxQuant score",132.1400000,1.0000000,,,,1.4448700312641E-5,
SNASRSDIYSR,ph,S,212,true,"Tissue atlas Arabidopsis - ProteomicsDB",114,32188942,"MaxQuant score",134.9100000,0.9649590,,,,6.3428302610191E-7,
SNASRSDIYSR,ph,S,214,true,"atm and atr DNA damage response",88,25561503,"MASCOT Score",21.0000000,1.0000000,,,,,0.2000000
SNASRSDIYSR,ph,S,214,true,"Tissue atlas Arabidopsis - ProteomicsDB",114,32188942,"MaxQuant score",100.4000000,0.9965750,,,,2.9958899176563E-5,
SNASRSDIYSR,ph,S,218,true,"atm and atr DNA damage response",88,25561503,"MASCOT Score",21.0000000,1.0000000,,,,,0.2000000
SQGLSATPRPSNLTNAEIYSLQSSR,ph,S,221,true,"Tissue atlas Arabidopsis - ProteomicsDB",114,32188942,"MaxQuant score",214.0000000,1.0000000,,,,0,
SQGLSATPR,ph,S,221,true,"atm and atr DNA damage response",88,25561503,"MASCOT Score",64.0000000,1.0000000,,,,,1.8600000
SQGLSATPR,ph,S,225,true,"Tissue atlas Arabidopsis - ProteomicsDB",114,32188942,"MaxQuant score",132.6000000,0.9737790,,,,2.8082021225069E-42,
SQGLSATPRPSNLTNAEIYSLQSSR,ph,T,227,true,"Phosphorylation Early Elicitor Signaling",23,17317660,,,,,,,,
SQGLSATPRPSNLTNAEIYSLQSSR,ph,T,227,true,"Tissue atlas Arabidopsis - ProteomicsDB",114,32188942,"MaxQuant score",353.0700000,0.9999840,,,,0,
SQGLSATPRPSNLTNAEIYSLQSSR,ph,S,231,true,"Tissue atlas Arabidopsis - ProteomicsDB",114,32188942,"MaxQuant score",311.2100000,0.9999060,,,,0,
PSNLTNAEIYSLQSSR,ph,S,240,true,"Tissue atlas Arabidopsis - ProteomicsDB",114,32188942,"MaxQuant score",319.3300000,0.9998380,,,,0,
PSNLTNAEIYSLQSSRNPTPR,ph,T,248,true,"Tissue atlas Arabidopsis - ProteomicsDB",114,32188942,"MaxQuant score",220.6600000,0.9974650,,,,0,
GSSFNHTDFYSMMASGGGR,ph,S,252,true,"atm and atr DNA damage response",88,25561503,"MASCOT Score",57.0000000,1.0000000,,,,,-0.1800000
GSSFNHTDFYSMMASGGGR,ph,S,252,true,"Tissue atlas Arabidopsis - ProteomicsDB",114,32188942,"MaxQuant score",303.3400000,0.9999960,,,,0,
GSSFNHTDFYSMMASGGGR,ph,S,253,true,"atm and atr DNA damage response",88,25561503,"MASCOT Score",56.0000000,0.9370000,,,,,-0.5800000
GSSFNHTDFYSMMASGGGR,ph,S,253,true,"Tissue atlas Arabidopsis - ProteomicsDB",114,32188942,"MaxQuant score",303.3400000,0.9999810,,,,0,
NSNFGPGEAVFGSKGPTPR,ph,S,271,true,"Tissue atlas Arabidopsis - ProteomicsDB",114,32188942,"MaxQuant score",214.4100000,1.0000000,,,,0,
NSNFGPGEAVFGSK,ph,S,271,true,"Plasmembrane Ph Immune Responses",25,17651370,,,,,,,,
NSNFGPGEAVFGSK,ph,S,271,true,"atm and atr DNA damage response",88,25561503,"MASCOT Score",73.0000000,1.0000000,,,,,-0.8100000
NSNFGPGEAVFGSK,ph,S,271,true,"Phospho cell culture sucrose/TOR",109,30833711,,,0.9999720,,,,,
NSNFGPGEAVFGSK,ph,S,282,true,"Phytohormone-responsive phosphoproteins",34,20374526,"MASCOT Score",46.0000000,,,,,,12.3533000
NSNFGPGEAVFGSK,ph,S,282,true,"atm and atr DNA damage response",88,25561503,"MASCOT Score",73.0000000,1.0000000,,,,,-0.9800000
NSNFGPGEAVFGSK,ph,S,282,true,"Tissue atlas Arabidopsis - ProteomicsDB",114,32188942,"MaxQuant score",193.3800000,1.0000000,,,,1.4012984643248E-45,
GPTPRPSNYEEDGGPAKPTAAGTAAGAGR,ph,T,286,true,"Tissue atlas Arabidopsis - ProteomicsDB",114,32188942,"MaxQuant score",186.9500000,1.0000000,,,,0,
GPTPRPSNYEEDGGPAKPTAAGTAAGAGR,ph,S,290,true,"Phosphorylation Early Elicitor Signaling",23,17317660,,,,,,,,
GPTPRPSNYEEDGGPAKPTAAGTAAGAGR,ph,S,290,true,"Tissue atlas Arabidopsis - ProteomicsDB",114,32188942,"MaxQuant score",231.0400000,0.9999760,,,,0,
FHYQSGGSGGGGGAHYPAPNPGMFSPNTGGGGGTAAK,ph,S,320,true,"Tissue atlas Arabidopsis - ProteomicsDB",114,32188942,"MaxQuant score",182.0700000,0.9912420,,,,0,
FHYQSGGSGGGGGAHYPAPNPGMFSPNTGGGGGTAAK,ph,S,337,true,"Phosphorylation Early Elicitor Signaling",23,17317660,,,,,,,,
FHYQSGGSGGGGGAHYPAPNPGMFSPNTGGGGGTAAK,ph,S,337,true,"TOR Kinase and ABA Receptor",100,29290610,XCorr,6.4032879,0.9669000,,,,2.3459999738407E-6,
FHYQSGGSGGGGGAHYPAPNPGMFSPNTGGGGGTAAK,ph,S,337,true,"Tissue atlas Arabidopsis - ProteomicsDB",114,32188942,"MaxQuant score",276.0200000,0.9999990,,,,0,
DLHMFVWSSSASPVSDVFGGGGGNHHADYSTATNDHQK,ph,S,377,true,"Tissue atlas Arabidopsis - ProteomicsDB",114,32188942,"MaxQuant score",218.7900000,0.9672350,,,,0,
ISVPQGNSNDNQYVER,ph,S,414,true,"Tissue atlas Arabidopsis - ProteomicsDB",114,32188942,"MaxQuant score",166.4800000,1.0000000,,,,4.9714299276988E-19,
EEFSFGNKDDDSK,ph,S,426,true,"Tissue atlas Arabidopsis - ProteomicsDB",114,32188942,"MaxQuant score",289.7200000,1.0000000,,,,0,
EEFSFGNKDDDSKVLATDGGNNISNK,ph,S,434,true,"Tissue atlas Arabidopsis - ProteomicsDB",114,32188942,"MaxQuant score",368.1200000,1.0000000,,,,0,
VLATDGGNNISNK,ph,S,446,true,"Tissue atlas Arabidopsis - ProteomicsDB",114,32188942,"MaxQuant score",155.2600000,1.0000000,,,,7.434229898351E-10,
VLATDGGNNISNKTTQAK,ph,T,449,true,"Tissue atlas Arabidopsis - ProteomicsDB",114,32188942,"MaxQuant score",106.6300000,0.8139680,,,,1.538989942429E-11,
