Peptide,PTM,ModifiedAA,ModifiedPosition,PeptideUniqueToGene,ExperimentDesc,ExpID,PubmedID,ScoreType,IdentScore,LocProb,Log2FChange,PQ-val,QuantSig,PEP,MassErrorPPM
ATKAASSSSLPKSGAISKGY,nta,A,2,true,"Arg/N-end rule pathway Roots",80,25728785,"MASCOT Score",36.7400000,,,,,5.2110000979155E-5,
AASSSSLPK,ph,S,7,true,"Tissue atlas Arabidopsis - ProteomicsDB",114,32188942,"MaxQuant score",145.9900000,0.9462500,,,,0.00012030499783577,
TLHDACDR,sno,C,162,true,"hot5-4 / wildtype, FAT-switch S-nitrosoproteome",169,37277371,,,,,,,,
TLHDACDR,so,C,162,true,"Arabidopsis S-sulfenylation chemoproteomics",108,31578252,"pFind PSM Score",0.2639260,,1.9607800,,,,-0.0467172
EYVQILAECHR,so,C,321,true,"Arabidopsis S-sulfenylation chemoproteomics",108,31578252,"pFind PSM Score",0.1886600,,,,,,-1.3295507
VEVLGDQSAR,ph,S,430,true,"Tissue atlas Arabidopsis - ProteomicsDB",114,32188942,"MaxQuant score",110.3800000,1.0000000,,,,0.00021663399820682,
LEGSPNTTSETDLRDDENADVFK,ph,S,486,true,"Tissue atlas Arabidopsis - ProteomicsDB",114,32188942,"MaxQuant score",208.8300000,0.9999970,,,,0,
TLSCLSK,sno,C,517,true,"hot5-4 / wildtype, FAT-switch S-nitrosoproteome",169,37277371,,,,,,,,
ASKLIIKR,ac,K,550,true,"Lysine acetylation gel-based Finkemeier et al",37,21311031,i-probability,0.8556390,,,,,,
ELDFSHLLEHLR,ph,S,593,true,"Tissue atlas Arabidopsis - ProteomicsDB",114,32188942,"MaxQuant score",54.2760000,1.0000000,,,,0.0066185002215207,
TTCEEFIMSVTK,sno,C,645,true,"hot5-4 / wildtype, FAT-switch S-nitrosoproteome",169,37277371,,,,,,,,
TTCEEFIMSVTK,so,C,645,true,"Arabidopsis S-sulfenylation chemoproteomics",108,31578252,"pFind PSM Score",0.0066385,,1.7241400,,,,-0.7012501
VALSSGTQNHK,ph,S,676,true,"Tissue atlas Arabidopsis - ProteomicsDB",114,32188942,"MaxQuant score",70.3730000,0.9154580,,,,0.00080384401371703,
