Peptide,PTM,ModifiedAA,ModifiedPosition,PeptideUniqueToGene,ExperimentDesc,ExpID,PubmedID,ScoreType,IdentScore,LocProb,Log2FChange,PQ-val,QuantSig,PEP,MassErrorPPM
QSIDFSLNK,ph,S,60,true,"Tissue atlas Arabidopsis - ProteomicsDB",114,32188942,"MaxQuant score",92.4090000,0.9999940,,,,0.0020127999596298,
ADGPSSKVR,ph,S,244,true,"Chloroplast kinase substrates",60,19376835,"MASCOT Score",31.7600000,,,,,,-3.1303400
SWSHSSHASDVDSEDK,ph,S,313,true,"Tyrosine phosphorylation in Arabidopsis",59,18463617,"MASCOT Score",54.0000000,,,,,,-0.2159023
SWSHSSHASDVDSEDK,ph,S,313,true,"Conserved plant phosphoproteome - Arabidopsis",61a,20466843,"MASCOT Score",45.0000000,1.0000000,,,,,
SWSHSSHASDVDSEDK,ph,S,315,true,"Tyrosine phosphorylation in Arabidopsis",59,18463617,"MASCOT Score",47.0000000,,,,,,-1.0255368
SWSHSSHASDVDSEDK,ph,S,315,true,"atm and atr DNA damage response",88,25561503,"MASCOT Score",66.0000000,1.0000000,,,,,0.3700000
SWSHSSHASDVDSEDK,ph,S,315,true,"TOR Kinase and ABA Receptor",100,29290610,XCorr,4.8692727,0.9926000,,,,9.9780002926764E-8,
SWSHSSHASDVDSEDK,ph,S,315,true,"Phospho cell culture sucrose/TOR",109,30833711,,,0.9838420,,,,,
SWSHSSHASDVDSEDK,ph,S,315,true,"Tissue atlas Arabidopsis - ProteomicsDB",114,32188942,"MaxQuant score",240.8200000,0.9998540,,,,0,
SWSHSSHASDVDSEDK,ph,S,317,true,"Tyrosine phosphorylation in Arabidopsis",59,18463617,"MASCOT Score",38.0000000,,,,,,-0.7556585
SWSHSSHASDVDSEDK,ph,S,317,true,"TOR Kinase and ABA Receptor",100,29290610,XCorr,3.0130081,0.8561000,,,,0.0033710000570863,
SWSHSSHASDVDSEDK,ph,S,318,true,"Tyrosine phosphorylation in Arabidopsis",59,18463617,"MASCOT Score",45.0000000,,,,,,-1.0255369
SWSHSSHASDVDSEDK,ph,S,318,true,"Conserved plant phosphoproteome - Arabidopsis",61a,20466843,"MASCOT Score",45.0000000,1.0000000,,,,,
SWSHSSHASDVDSEDK,ph,S,318,true,"TOR Kinase and ABA Receptor",100,29290610,XCorr,3.0130081,0.9452000,,,,0.0033710000570863,
ENLEAAEAKSKADKPPTSEQMQK,ph,S,638,true,"Large-scale phosphorylation discovery",44,23111157,XCorr,2.7030000,,,,,,
