Peptide,PTM,ModifiedAA,ModifiedPosition,PeptideUniqueToGene,ExperimentDesc,ExpID,PubmedID,ScoreType,IdentScore,LocProb,Log2FChange,PQ-val,QuantSig,PEP,MassErrorPPM
DSEGKDYLYR,ac,K,78,true,"Histone deacetylases substrates - hda14 vs WT",98e,29061669,"MaxQuant Score",52.2000000,1.0000000,1.0070000,0.5333349,NO,0.0080000003799796,
TGNDFSTLYAPLIR,nt,T,290,false,"N-terminal ChaFRADIC",92,26010716,"MASCOT Score",30.3300000,,,,,1.3920000128564E-5,
TGNDFSTLYAPLIR,nt,T,290,false,"Stromal N-terminome",96,26371235,"MASCOT Score",89.4200000,,,,,,
VPLIVTGNDFSTLYAPLIR,ph,T,290,true,"Phosphorylation tonoplast membrane fraction",107,18686298,"MASCOT Score",101.0000000,,,,,,
DFSTLYAPLIR,nt,D,293,false,"N-terminal ChaFRADIC",92,26010716,"MASCOT Score",35.1900000,,,,,2.2209999315237E-6,
DFSTLYAPLIR,nt,D,293,false,"Stromal N-terminome",96,26371235,"MASCOT Score",40.3200000,,,,,,
DFSTLYAPLIR,nt,D,293,false,"FtsH12 N-terminome: WT / FtsH12 knockdown miRNA",118,33216923,"MaxQuant score",120.5700000,,-0.3174557,0.0180848,NO,1.3099999973676E-9,
TLYAPLIR,nt,T,296,false,"Stromal N-terminome",96,26371235,"MASCOT Score",40.9600000,,,,,,
