Peptide,PTM,ModifiedAA,ModifiedPosition,PeptideUniqueToGene,ExperimentDesc,ExpID,PubmedID,ScoreType,IdentScore,LocProb,Log2FChange,PQ-val,QuantSig,PEP,MassErrorPPM
GGVPFTNANVSFLR,ng,N,101,true,"Conserved N-glycosylation",74,22633491,"MaxQuant Score",143.0700000,1.0000000,,,,3.6129998691875E-20,3.2470000
GGVPFTNANVSFLR,ng,N,101,true,"N-glycan occupancy Arabidopsis glycoproteins",87,23994444,"Ladder score",65.4000000,,,,,,
GGVPFTNANVSFLR,ng,N,101,true,"N-Glycopeptide Profiling in Arabidopsis Infloresce",132,27067053,"MOWSE score",45.4000000,,,,,6.8999997893116E-7,
GGVPFTNANVSFLR,ng,N,101,true,"N-linked Glycan Micro-heterogeneity Arabidopsis",134,29237727,,,,,,,,
GGVPFTNANVSFLR,ng,N,101,true,"UDP-GlcNAc transporter glycopeptide analysis",135,30224661,,,,,,,4.1269222492701E-6,0.3000000
DISASSASQAFVSTDGVYNAR,nt,D,114,true,"FtsH12 N-terminome: WT / FtsH12 knockdown miRNA",118,33216923,"MaxQuant score",53.9670000,,,,,0.0079084997996688,
NKYQLHEAFNGSFILEK,ng,N,420,true,"N-Glycopeptide Profiling in Arabidopsis Infloresce",132,27067053,"MOWSE score",40.0000000,,,,,0.00015000000712462,
YQLHEAFNGSFILEK,ng,N,420,true,"Conserved N-glycosylation",74,22633491,"MaxQuant Score",199.0200000,1.0000000,,,,0,-0.6260000
FLNYTQCDKQNVHK,ng,N,482,true,"N-Glycopeptide Profiling in Arabidopsis Infloresce",132,27067053,"MOWSE score",20.8000000,,,,,0.014000000432134,
FLNYTQCDK,ng,N,482,true,"Conserved N-glycosylation",74,22633491,"MaxQuant Score",116.4200000,1.0000000,,,,0.00030270000570454,-0.1780000
