Peptide,PTM,ModifiedAA,ModifiedPosition,PeptideUniqueToGene,ExperimentDesc,ExpID,PubmedID,ScoreType,IdentScore,LocProb,Log2FChange,PQ-val,QuantSig,PEP,MassErrorPPM
MEPRVGNKF,nta,M,1,false,"Arabidopsis translation initiation landscape - NTA",167a,35069635,,,,,,,,
FDDKPDYAYLKR,ac,K,269,false,"Quantitative Acetylproteomics",101,29440448,,,,,,,,
YQQSQISTPPPR,ph,T,301,true,"Large-scale phosphorylation discovery",44,23111157,XCorr,3.3330000,,,,,,
YQQSQISTPPPR,ph,T,301,true,"TOR Kinase and ABA Receptor",100,29290610,XCorr,2.8818200,0.9843000,,,,0.0012369999894872,
YQQSQISTPPPR,ph,T,301,true,"Tissue atlas Arabidopsis - ProteomicsDB",114,32188942,"MaxQuant score",264.0900000,0.9761070,,,,0,
RNSGQIFNSGSLAK,ph,S,347,true,"atm and atr DNA damage response",88,25561503,"MASCOT Score",50.0000000,1.0000000,,,,,0.2200000
RNSGQIFNSGSLAK,ph,S,347,true,"TOR Kinase and ABA Receptor",100,29290610,XCorr,4.3723841,1.0000000,,,,2.4709999706829E-5,
RNSGQIFNSGSLAK,ph,S,347,true,"Phosphorylation tonoplast membrane fraction",107,18686298,"MASCOT Score",25.0000000,,,,,,
RNSGQIFNSGSLAK,ph,S,347,true,"Tissue atlas Arabidopsis - ProteomicsDB",114,32188942,"MaxQuant score",187.3900000,1.0000000,,,,2.2072299729091E-23,
RNSGQIFNSGSLAK,ph,S,353,true,"Tissue atlas Arabidopsis - ProteomicsDB",114,32188942,"MaxQuant score",140.4300000,0.9360190,,,,1.216970031237E-5,
RNSGQIFNSGSLAK,ph,S,355,true,"atm and atr DNA damage response",88,25561503,"MASCOT Score",50.0000000,0.9970000,,,,,-0.6500000
RNSGQIFNSGSLAK,ph,S,355,true,"Tissue atlas Arabidopsis - ProteomicsDB",114,32188942,"MaxQuant score",93.5100000,0.9926990,,,,0.00014214200200513,
NSGQIFNSGSLAK,ph,S,355,true,"TOR Kinase and ABA Receptor",100,29290610,XCorr,3.9934113,0.9906000,,,,0.00010160000238102,
APVSSDPAISK,ph,S,364,true,"atm and atr DNA damage response",88,25561503,"MASCOT Score",22.0000000,0.9940000,,,,,-0.0600000
APVSSDPAISK,ph,S,364,true,"Tissue atlas Arabidopsis - ProteomicsDB",114,32188942,"MaxQuant score",85.5360000,0.9413110,,,,0.0009965019999072,
APVSSDPAISK,ph,S,365,true,"atm and atr DNA damage response",88,25561503,"MASCOT Score",52.0000000,0.9980000,,,,,0.7600000
APVSSDPAISK,ph,S,365,true,"Tissue atlas Arabidopsis - ProteomicsDB",114,32188942,"MaxQuant score",82.7050000,0.8783990,,,,0.0012975899735466,
DVVLSSSSFLR,ph,S,376,true,"atm and atr DNA damage response",88,25561503,"MASCOT Score",34.0000000,0.8970000,,,,,-0.0700000
DVVLSSSSFLR,ph,S,376,true,"Tissue atlas Arabidopsis - ProteomicsDB",114,32188942,"MaxQuant score",101.8900000,0.8931570,,,,7.1908201789483E-5,
DVVLSSSSFLR,ph,S,377,true,"Tissue atlas Arabidopsis - ProteomicsDB",114,32188942,"MaxQuant score",181.6600000,0.9593790,,,,4.3227299859191E-14,
DVVLSSSSFLR,ph,S,378,true,"atm and atr DNA damage response",88,25561503,"MASCOT Score",44.0000000,0.9920000,,,,,0.9000000
DVVLSSSSFLR,ph,S,378,true,"Tissue atlas Arabidopsis - ProteomicsDB",114,32188942,"MaxQuant score",125.2800000,0.7662180,,,,1.3889600268158E-5,
DVVLSSSSFLR,ph,S,379,true,"Large-scale phosphorylation discovery",44,23111157,XCorr,3.7830000,,,,,,
DVVLSSSSFLR,ph,S,379,true,"srk2dei ABA signaling phopshoproteomics",83,23572148,"MASCOT Score",73.0000000,,,,,,0.0001000
DVVLSSSSFLR,ph,S,379,true,"SnRK2 protein kinase substrates",85,23776212,XCorr,3.2436337,0.9990000,,,,2.1899000785197E-5,
DVVLSSSSFLR,ph,S,379,true,"atm and atr DNA damage response",88,25561503,"MASCOT Score",44.0000000,1.0000000,,,,,0.9000000
DVVLSSSSFLR,ph,S,379,true,"TOR Kinase and ABA Receptor",100,29290610,XCorr,4.3044648,0.9975000,,,,8.3790000644512E-6,
DVVLSSSSFLR,ph,S,379,true,"Tissue atlas Arabidopsis - ProteomicsDB",114,32188942,"MaxQuant score",198.5500000,0.9821980,,,,8.1911498119518E-19,
EAAVLGTDSEPSNPQIVEAGSGSNSKIPVSR,ph,S,417,true,"Tissue atlas Arabidopsis - ProteomicsDB",114,32188942,"MaxQuant score",245.6800000,0.7588630,,,,0,
EAAVLGTDSEPSNPQIVEAGSGSNSK,ph,S,421,true,"TOR Kinase and ABA Receptor",100,29290610,XCorr,6.6896896,0.9636000,,,,1.0759999558019E-9,
EAAVLGTDSEPSNPQIVEAGSGSNSKIPVSR,ub,K,422,true,"Arabidopsis ubiquitination COFRADIC",40,26744219,"MaxQuant Score",96.1230000,1.0000000,,,,0,-0.1530000
IPVSRNSPIVSSEINK,ph,S,426,true,"Tissue atlas Arabidopsis - ProteomicsDB",114,32188942,"MaxQuant score",89.4830000,0.8118030,,,,3.4839100408135E-5,
IPVSRNSPIVSSEINK,ph,S,429,true,"TOR Kinase and ABA Receptor",100,29290610,XCorr,3.5720868,0.9998000,,,,0.00026510001043789,
NSPIVSSEINK,ph,S,429,true,"STN8 phosphoproteome",38,21768351,"MASCOT Score",50.2600000,,,,,,-0.0562686
NSPIVSSEINK,ph,S,429,true,"Chloroplast kinase substrates",60,19376835,"MASCOT Score",34.6200000,,,,,,-0.0089724
NSPIVSSEINK,ph,S,429,true,"srk2dei ABA signaling phopshoproteomics",83,23572148,"MASCOT Score",32.0000000,,,,,,0.0000000
NSPIVSSEINK,ph,S,429,true,"atm and atr DNA damage response",88,25561503,"MASCOT Score",55.0000000,1.0000000,,,,,-0.3800000
NSPIVSSEINK,ph,S,429,true,"Tissue atlas Arabidopsis - ProteomicsDB",114,32188942,"MaxQuant score",132.0100000,1.0000000,,,,2.7306200536259E-6,
NSPIVSSEINK,ph,S,433,true,"atm and atr DNA damage response",88,25561503,"MASCOT Score",50.0000000,0.9980000,,,,,0.4500000
NSPIVSSEINK,ph,S,433,true,"Tissue atlas Arabidopsis - ProteomicsDB",114,32188942,"MaxQuant score",132.0100000,0.9201300,,,,2.7306200536259E-6,
NSPIVSSEINKLSSPSR,ph,S,441,true,"STN8 phosphoproteome",38,21768351,"MASCOT Score",43.9100000,,,,,,-0.9327230
NSPIVSSEINKLSSPSR,ph,S,441,true,"Phosphoproteome ethylene-regulated time response",46,24043427,"MASCOT Score",49.9600000,,,,,,-5.5332000
NSPIVSSEINKLSSPSR,ph,S,441,true,"Chloroplast kinase substrates",60,19376835,"MASCOT Score",41.4400000,,,,,,-1.4496200
NSPIVSSEINKLSSPSR,ph,S,441,true,"Tissue atlas Arabidopsis - ProteomicsDB",114,32188942,"MaxQuant score",192.1200000,0.7876600,,,,8.6810706111631E-39,
